program: Gaussian 09
title: 000295067
version: EM64L-G09RevD.01
frameworkgroup: C1[X(C13H20N2O)]
method: RPBEPBE
basis: SDD
operation: Freq
keyword: #p
keyword: freq=noraman
keyword: PBEPBE/SDD
title: #p freq=noraman PBEPBE/SDD
converged: YES YES NO NO
title: Mulliken charges:
elementType: O N N C C C C C C C C C C C C C H H H H H H H H H H H H H H H H H H H H
charge: -0.282743 -0.512903 -0.416726 0.159576 0.381150 0.353196 -0.012308 0.491972 -0.576828 -0.639603 0.252376 -0.669379 -0.704007 -0.835667 -0.851019 -0.819201 0.246435 0.232919 0.234217 0.288645 0.278535 0.209496 0.192648 0.252618 0.232404 0.221749 0.196982 0.215443 0.284632 0.216526 0.238118 0.215930 0.246461 0.224074 0.221214 0.233071
chargesum: 0.00000
title: Mulliken charges with hydrogens summed into heavy atoms:
elementType: O N N C C C C C C C C C C C C C
charge: -0.282743 -0.224257 -0.138191 0.159576 0.381150 0.353196 0.234127 0.491972 -0.343910 -0.405387 0.252376 -0.014617 -0.052872 -0.119067 -0.150511 -0.140842
polarizability: 2.29280968e+02 -2.93615521e+00 1.60525051e+02 8.11530570e+00 -2.82860755e+00 1.03492886e+02
1716.lowfreq: -8.8846 -0.0007 -0.0005 -0.0004 3.7990 11.6745 27.6442 28.7786 39.1664
frequency: 27.5323 28.3397 39.0746 52.1248 80.5718 98.1760 129.9233 171.0093 178.1756 190.7486 200.6292 216.0041 230.9466 233.1978 258.0151 271.2466 304.5924 316.6403 340.0651 360.7337 391.6826 430.0111 456.8698 492.8430 516.0867 518.6786 529.0263 544.8844 565.7242 580.5504 692.3673 723.6894 743.9714 799.2907 857.7652 866.2046 894.0082 916.9656 923.7697 940.4597 950.7742 955.0400 1010.9984 1018.5861 1026.7731 1037.5832 1044.3527 1046.3830 1054.3655 1141.6165 1142.8262 1165.8735 1184.7472 1215.4963 1247.3799 1263.2122 1306.9164 1327.6311 1347.7648 1366.0274 1374.2716 1392.8654 1394.9403 1395.3446 1397.6944 1415.7857 1439.3302 1451.8722 1458.1553 1464.1025 1467.0110 1469.0897 1470.7104 1473.2355 1478.5880 1484.5401 1486.4921 1493.8983 1499.6629 1600.5956 1620.6294 1640.6918 2953.1449 2972.5953 2973.0404 2975.4730 2976.4546 3031.4460 3032.3170 3051.6387 3057.2600 3065.1669 3077.5286 3080.1097 3083.5901 3085.4070 3090.4134 3094.2409 3111.7808 3116.8066 3513.4894 3531.4214
redmass: 1.0909 2.7067 3.3564 3.4558 4.4720 3.8331 4.0620 1.6900 1.2187 2.3101 1.6491 1.0395 2.6162 2.4887 1.2436 2.4634 2.4598 3.3553 1.7539 3.8626 2.5551 2.0708 2.7958 2.6989 2.8981 1.6756 3.0481 4.1036 4.1307 3.2073 6.1556 5.4131 4.0486 3.7591 2.3643 1.3911 1.3111 1.3893 1.9622 1.6244 2.0078 3.3075 1.6219 1.7233 2.8033 1.6553 1.7686 1.5411 1.5992 2.1533 2.0592 1.8461 1.9849 2.0171 1.8672 1.7073 1.5312 5.4408 1.3143 4.7805 1.2192 1.2308 1.2724 1.2546 1.2553 2.5299 1.5497 1.3671 1.2531 1.0854 1.0534 1.2205 1.0621 1.2813 1.0854 1.1805 1.0598 1.3566 1.5706 6.6011 5.7233 5.4805 1.0432 1.0375 1.0374 1.0363 1.0368 1.0852 1.0911 1.0968 1.0969 1.0979 1.0975 1.0990 1.0998 1.0976 1.1001 1.1000 1.0911 1.0918 1.0755 1.0766
irintensity: 0.3690 0.5994 0.7187 0.7804 6.1814 4.3041 1.7645 8.3187 0.7553 1.1793 6.0612 0.0989 0.9326 5.4873 2.1659 2.2833 3.5570 2.0403 13.9790 1.9531 10.6351 23.1106 9.3453 19.4761 7.9044 122.0355 27.5568 1.6467 1.3444 5.5282 12.9908 22.7300 3.1744 3.3480 5.3970 17.3913 0.6328 2.8079 4.2596 1.5605 1.6800 0.2667 15.2481 2.3154 8.4621 3.6990 0.7497 7.8074 18.3630 32.0059 4.2877 28.8634 42.1773 292.3584 8.8921 36.5848 21.0510 6.4335 5.2512 57.9435 25.7247 36.4814 18.4988 17.2436 6.4624 4.1804 43.5594 20.3429 96.1992 1.5234 12.3559 196.2030 36.3571 161.8505 0.8309 99.2682 48.6637 172.9957 27.9077 5.9282 22.9525 130.0063 42.9989 26.6613 48.2055 20.9616 40.5793 0.3975 21.4106 23.3349 12.7494 6.4569 78.0032 18.2485 20.3712 21.3708 22.2997 40.6273 29.1435 18.5459 11.4718 14.6946
temp: 298.150 k
press: 1.00000 atm
elementType: 8 7 7 6 6 6 6 6 6 6 6 6 6 6 6 6 1 1 1 1 1 1 1 1 1 1 1 1 1 1 1 1 1 1 1 1
symmnumber: 1
zpe: 802752.7 jmol-1
zpe.correction: 0.305752 hartree
zpe.thermalcorrener: 0.324173 hartree
zpe.thermalcorrenthalpy: 0.325117 hartree
zpe.thermalcorrgfe: 0.258356 hartree
zpe.sumelectzpe: -690.923534 hartree
zpe.sumelectthermal: -690.905114 hartree
zpe.sumelectthermalent: -690.904169 hartree
zpe.sumelectthermalfe: -690.970930 hartree
dipole: -1.3441 2.2391 -2.9588
dipole: 3.9465
quadrupole: -82.1914 -91.3956 -101.1972
quadrupole: -3.0322 5.4428 -0.3572
quadrupole: 9.4033 0.1992 -9.6025 -3.0322 5.4428 -0.3572
hfenergy: -691.2292865 hartree
pointgroup: C01 [X(C13H20N2O1)]
dipole: -0.5396165 -0.6475805 1.3039156 debye
polarizability: 229.0223711|-1.667673|157.9362653|-10.62635|-11.811608|106.3402684 unknown
InChI: InChI=1S/C13H20N2O/c1-8(2)14-13(16)15-12-10(4)6-9(3)7-11(12)5/h6-8,14-15H,1-5H3
charge 0 multiplicity 1
36 atoms
O  -1.476716 0.545772 -1.290811
N  -0.522409 -0.415705 0.649896
N  -2.850718 -0.244962 0.432155
C  0.864778 -0.228247 0.333177
C  1.398968 1.072943 0.098776
C  1.711392 -1.375666 0.323312
C  -4.10647 0.109682 -0.265527
C  3.648268 0.067264 -0.198345
C  2.78282 1.187552 -0.174197
C  3.091901 -1.206258 0.067632
C  -1.605758 0.007202 -0.150889
C  -4.483326 1.592815 -0.031817
C  -5.228646 -0.852732 0.172578
C  0.533929 2.31447 0.160436
C  1.141236 -2.761867 0.573908
C  5.126641 0.231876 -0.508416
H  -3.898339 -0.025833 -1.342206
H  3.196721 2.18768 -0.357743
H  3.741777 -2.090457 0.06065
H  -0.728007 -1.1209 1.361516
H  -2.910797 -0.465304 1.428579
H  -5.384716 1.862199 -0.612948
H  -4.693723 1.784734 1.037834
H  -3.655269 2.246935 -0.354322
H  -4.953772 -1.902474 -0.032651
H  -6.162255 -0.62452 -0.371361
H  -5.442998 -0.751444 1.255172
H  1.154267 3.222867 0.249083
H  -0.09362 2.396021 -0.7458
H  -0.15845 2.277432 1.022719
H  1.906516 -3.536632 0.399455
H  0.784966 -2.892127 1.617344
H  0.284425 -2.971502 -0.093897
H  5.57274 1.059404 0.073722
H  5.693571 -0.687426 -0.280144
H  5.287475 0.464806 -1.578873
