program: Gaussian 09
title: 000295062
version: EM64L-G09RevD.01
frameworkgroup: C1[X(C14H11ClN2O4)]
method: RPBEPBE
basis: SDD
operation: Freq
keyword: #p
keyword: freq=noraman
keyword: PBEPBE/SDD
title: #p freq=noraman PBEPBE/SDD
converged: YES YES NO NO
title: Mulliken charges:
elementType: Cl O O O O N N C C C C C C C C C C C C C C H H H H H H H H H H H
charge: -0.054487 -0.336532 -0.246988 -0.217172 -0.206302 -0.458903 0.022124 0.417533 0.201127 -0.476669 0.389191 -0.341240 -0.408836 -0.773561 0.512207 -0.434037 -0.354374 0.249931 -0.046947 -0.188386 -0.249677 0.311476 0.292628 0.266247 0.221982 0.255264 0.255099 0.343779 0.255465 0.301166 0.237314 0.261579
chargesum: 0.00000
title: Mulliken charges with hydrogens summed into heavy atoms:
elementType: Cl O O O O N N C C C C C C C C C C C C C C
charge: -0.054487 -0.336532 -0.246988 -0.217172 -0.206302 -0.115124 0.022124 0.417533 0.201127 -0.165193 0.389191 -0.048612 -0.142588 -0.041217 0.512207 -0.178572 -0.053209 0.249931 -0.046947 0.048928 0.011902
polarizability: 3.74152386e+02 4.01977497e+00 2.01856666e+02 -1.24023783e-01 1.40934401e-01 7.54989097e+01
1716.lowfreq: -4.0471 -3.2959 -2.3020 -0.0024 0.0009 0.0011 11.1952 18.7203 22.4746
frequency: 10.8568 18.6610 22.4188 46.2148 56.5727 71.0441 122.4463 126.6258 178.6570 183.1685 199.5850 229.0641 234.9642 253.7676 266.6931 308.0118 308.4555 361.2074 387.0929 394.2238 412.8977 438.1715 443.0170 502.9604 553.3005 558.4442 562.9284 565.0507 643.9922 648.8072 665.3099 676.7736 683.6544 691.0437 696.7003 728.0142 759.7354 773.3154 791.4907 841.8036 863.9877 865.1801 908.2945 909.4000 911.6580 978.6389 979.8840 985.3907 988.4317 1023.6088 1042.9458 1059.3102 1075.0085 1098.9073 1132.1843 1145.0638 1158.6067 1182.8099 1204.3788 1227.3851 1250.5343 1280.2956 1309.5875 1350.4350 1376.3244 1382.4666 1405.0872 1412.4863 1419.3121 1455.1730 1465.8228 1473.4818 1476.3577 1513.0496 1583.3501 1589.9009 1606.3353 1612.9882 1691.4519 2998.6229 3082.6994 3102.3408 3148.4202 3150.8296 3172.3857 3181.1202 3192.6741 3198.5492 3203.9124 3542.6822
redmass: 6.3808 9.8289 6.2765 9.0641 10.4639 6.3018 6.8974 9.4684 8.5022 5.3423 2.9360 9.5792 1.1189 4.2864 7.6676 7.0013 5.8222 5.9223 5.7618 8.9667 7.8161 3.0435 3.0975 5.5322 5.7403 4.0532 4.1686 7.1296 7.5175 1.9282 4.3412 8.0279 2.3041 7.3439 2.5542 5.2528 8.1387 9.4833 1.3213 1.4294 5.6137 1.5940 6.3315 1.3693 1.3632 3.1925 5.9995 1.3245 1.3189 1.7803 1.5428 4.5665 2.0877 1.5672 2.7311 1.9757 1.6210 1.0884 8.8872 3.5486 1.7509 1.5749 1.5121 5.9965 5.8203 3.2554 1.8974 2.9567 2.5040 1.0457 2.0522 1.6990 1.9444 2.1781 7.6830 5.3029 6.3091 6.5231 9.7576 1.0365 1.0959 1.1017 1.0926 1.0891 1.0894 1.0954 1.0966 1.0956 1.0925 1.0763
irintensity: 0.0318 0.4885 0.5526 0.6705 6.9136 0.4270 2.6217 2.8539 2.2253 1.0111 0.9318 2.1692 0.2181 3.3042 8.4139 0.2993 0.5753 2.8768 0.0067 9.0946 4.2331 7.0215 4.4174 1.0074 1.2237 3.1551 0.4693 7.9777 4.3795 14.2484 7.2415 36.2430 38.2748 13.5335 80.8469 0.4863 45.4522 5.5843 54.8159 36.6579 116.5637 51.9667 29.8227 11.4931 18.7819 254.9296 4.6369 0.4960 3.0763 63.2092 12.2813 57.6678 39.4152 134.4884 945.4296 246.2618 17.6139 0.3367 485.2278 52.6451 17.0972 91.6804 7.3771 95.2385 136.1151 48.4732 33.3826 110.5647 47.0516 13.3312 83.2098 239.9164 2.8059 434.7817 84.2641 152.0120 183.7352 66.1795 249.1583 8.1988 6.2759 21.1320 5.5659 6.4554 1.0157 2.0306 5.1784 4.9875 4.6696 37.5708
temp: 298.150 k
press: 1.00000 atm
elementType: 17 8 8 8 8 7 7 6 6 6 6 6 6 6 6 6 6 6 6 6 6 1 1 1 1 1 1 1 1 1 1 1
symmnumber: 1
zpe: 596858.2 jmol-1
zpe.correction: 0.227331 hartree
zpe.thermalcorrener: 0.246149 hartree
zpe.thermalcorrenthalpy: 0.247093 hartree
zpe.thermalcorrgfe: 0.176008 hartree
zpe.sumelectzpe: -1408.997579 hartree
zpe.sumelectthermal: -1408.978762 hartree
zpe.sumelectthermalent: -1408.977818 hartree
zpe.sumelectthermalfe: -1409.048903 hartree
dipole: -4.8862 -0.0572 0.0011
dipole: 4.8866
quadrupole: -178.1499 -117.2764 -130.6956
quadrupole: -1.5854 0.1270 -0.0157
quadrupole: -36.1093 24.7642 11.3451 -1.5854 0.1270 -0.0157
hfenergy: -1409.2249106 hartree
pointgroup: C01 [X(C14H11Cl1N2O4)]
dipole: 1.9186812 0.0435522 -0.1133006 debye
polarizability: 373.0260332|8.0491795|125.5180575|-16.0503441|61.3295978|152.9638718 unknown
InChI: InChI=1S/C14H11ClN2O4/c1-9-7-12(5-6-13(9)17(19)20)21-14(18)16-11-4-2-3-10(15)8-11/h2-8,16H,1H3
charge 0 multiplicity 1
32 atoms
Cl 7.177746 -0.761948 -1.513263
O  -0.106804 -0.628787 -0.66056
O  0.720958 0.802706 1.066434
O  -6.37295 -1.303008 -0.936501
O  -6.378683 0.155585 0.806903
N  2.104102 -0.330968 -0.486541
N  -5.758234 -0.547022 -0.083973
C  -3.503864 0.300789 0.754866
C  -4.278413 -0.493838 -0.143972
C  -2.093218 0.266574 0.59573
C  -1.495724 -0.522452 -0.411952
C  -3.672343 -1.284736 -1.153527
C  -2.281047 -1.303399 -1.293611
C  -4.064506 1.172889 1.861053
C  3.414419 0.068607 -0.100838
C  4.492365 -0.45238 -0.865555
C  3.668382 0.94211 0.98879
C  0.909198 0.042269 0.093288
C  5.803995 -0.087158 -0.522852
C  5.002175 1.281892 1.298109
C  6.090938 0.776111 0.551577
H  -1.466584 0.858164 1.263474
H  -4.316516 -1.872783 -1.811171
H  -1.791834 -1.904987 -2.063829
H  -3.242354 1.668359 2.403199
H  -4.74929 1.941824 1.463908
H  -4.665378 0.585153 2.575994
H  2.018991 -0.967394 -1.28243
H  4.311774 -1.127543 -1.708905
H  2.837736 1.340701 1.57335
H  5.199769 1.955407 2.138452
H  7.12229 1.042962 0.795755
