program: Gaussian 09
title: 000295019
version: EM64L-G09RevD.01
frameworkgroup: C1[X(C16H18N2O2)]
method: RPBEPBE
basis: SDD
operation: Freq
keyword: #p
keyword: freq=noraman
keyword: PBEPBE/SDD
title: #p freq=noraman PBEPBE/SDD
converged: YES YES NO NO
title: Mulliken charges:
elementType: O O N N C C C C C C C C C C C C C C C C H H H H H H H H H H H H H H H H H H
charge: -0.265205 -0.285956 -0.519389 -0.507541 0.094166 0.344302 0.376777 -0.358727 -0.461737 -0.884986 -0.225445 -0.844837 0.485714 0.264137 -0.466148 -0.312011 0.320696 -0.328146 -0.353235 -0.537952 0.307255 0.228765 0.227850 0.227840 0.272015 0.311828 0.224218 0.228162 0.228166 0.235061 0.285325 0.210451 0.309075 0.239287 0.249524 0.244899 0.217901 0.217901
chargesum: 0.00000
title: Mulliken charges with hydrogens summed into heavy atoms:
elementType: O O N N C C C C C C C C C C C C C C C C
charge: -0.265205 -0.285956 -0.207561 -0.222216 0.094166 0.344302 0.376777 -0.051472 -0.232972 -0.157280 -0.001227 -0.153448 0.485714 0.264137 -0.255697 -0.002936 0.320696 -0.088859 -0.103712 0.142749
polarizability: 3.66093654e+02 -6.57380991e+00 1.96785916e+02 2.62505618e-02 -1.78933082e-02 9.10603495e+01
1716.lowfreq: -7.1994 -1.9461 -0.0006 0.0006 0.0010 3.7505 18.1264 24.0350 53.5892
frequency: 15.2257 23.9453 53.5828 54.7159 66.7810 94.2526 129.9944 152.3889 157.5546 180.3462 180.6731 203.6374 228.8573 233.2241 247.3614 292.4907 304.0080 341.3938 351.0964 357.5399 413.7691 426.3657 438.7501 454.6353 496.6168 500.6440 518.8916 524.5162 570.7905 571.9926 610.8231 626.6366 668.8807 694.6940 719.1851 731.0259 749.6368 783.6456 794.5608 797.9879 803.6744 843.0708 849.6459 897.7837 909.9534 914.5596 983.8642 987.8260 990.9404 991.0757 994.1247 1002.5016 1028.8258 1050.9886 1078.8169 1099.5309 1110.5033 1119.0487 1155.6451 1173.1849 1180.7920 1192.3854 1193.1855 1220.5628 1263.6034 1268.1682 1300.4576 1304.4045 1362.5284 1371.1016 1393.1778 1402.3209 1420.8893 1428.6310 1434.5209 1458.6675 1464.9234 1468.4195 1472.3149 1472.5878 1493.5996 1500.6320 1503.3458 1510.1703 1529.4815 1593.1330 1602.4086 1610.5731 1631.3895 1652.7232 2945.4860 2952.8945 2972.1694 3008.4304 3038.0967 3047.0375 3083.5747 3106.8734 3113.2938 3122.0620 3125.2270 3150.0575 3161.4956 3163.2450 3198.5751 3199.0910 3523.2601 3544.3808
redmass: 3.5889 4.9342 4.5549 4.9129 5.6731 3.5021 2.2632 4.7365 3.1907 4.7080 1.2295 1.1961 1.9784 1.2376 4.4243 2.5604 5.5679 2.7585 3.1783 6.1838 3.0641 5.3729 1.8430 3.2642 4.7449 3.1297 4.7938 2.3307 2.8757 5.5932 1.3056 6.9533 5.5419 11.8395 3.5978 2.5561 5.8471 6.4651 1.4022 1.4232 4.8722 4.4509 1.4817 3.1371 1.3901 1.3421 1.3063 7.9373 1.3168 3.5099 1.4444 2.5943 1.4301 1.6101 2.2780 2.0050 1.2613 1.3298 1.3380 1.6920 1.2841 2.9308 1.5829 2.3420 1.7415 2.5905 1.7623 1.9664 4.8454 6.5865 1.2843 1.2154 3.8846 2.5584 1.1713 2.2620 1.0506 1.2361 1.0824 1.0462 1.2735 2.1893 1.0444 2.0732 1.9465 5.6044 6.4055 5.8354 6.4462 3.5898 1.0426 1.0333 1.0379 1.0977 1.1037 1.0976 1.0977 1.0894 1.0902 1.0988 1.0872 1.0960 1.0912 1.0928 1.0947 1.0950 1.0761 1.0749
irintensity: 1.2737 0.4258 0.1846 0.1311 5.9000 8.1771 0.0643 2.4210 1.1166 0.5721 0.0274 3.5450 0.1633 0.0158 12.0245 6.9016 7.2160 0.0559 4.9160 0.8547 0.0123 9.9446 0.1808 0.2846 8.6999 0.7288 16.3480 31.2546 11.5805 1.4291 122.3283 1.2337 2.9655 17.9838 0.0165 5.5870 13.6947 0.3862 38.9605 67.6705 0.0303 1.4118 67.5087 0.4865 1.1848 5.5026 1.7327 51.9908 3.3187 0.0528 15.2195 29.9526 9.7676 1.3460 1.8357 13.1683 0.2090 18.2721 0.7394 334.5151 39.7645 6.4061 203.7292 238.6190 10.5389 40.4902 94.9566 11.3294 25.6025 347.4924 4.4226 16.0776 4.0170 62.9499 25.5318 173.5315 13.1297 282.7581 59.5035 23.3715 391.5779 36.0990 1.2166 675.9403 106.1454 56.0778 85.3717 22.8056 1.9993 96.6417 35.6264 87.5328 41.3591 24.3642 54.5106 23.1570 23.1692 28.5110 15.2961 25.3181 10.2525 30.4658 7.9795 11.5602 15.5352 4.0521 11.0440 27.4182
temp: 298.150 k
press: 1.00000 atm
elementType: 8 8 7 7 6 6 6 6 6 6 6 6 6 6 6 6 6 6 6 6 1 1 1 1 1 1 1 1 1 1 1 1 1 1 1 1 1 1
symmnumber: 1
zpe: 806911.3 jmol-1
zpe.correction: 0.307336 hartree
zpe.thermalcorrener: 0.326750 hartree
zpe.thermalcorrenthalpy: 0.327694 hartree
zpe.thermalcorrgfe: 0.257873 hartree
zpe.sumelectzpe: -879.019552 hartree
zpe.sumelectthermal: -879.000139 hartree
zpe.sumelectthermalent: -878.999195 hartree
zpe.sumelectthermalfe: -879.069016 hartree
dipole: -0.1087 6.2073 -0.0008
dipole: 6.2082
quadrupole: -93.9582 -108.0178 -125.3778
quadrupole: -6.3414 0.0018 -0.0081
quadrupole: 15.1598 1.1001 -16.2599 -6.3414 0.0018 -0.0081
hfenergy: -879.3268885 hartree
pointgroup: C01 [X(C16H18N2O2)]
dipole: 0.0493741 -2.442011 -0.0003215 debye
polarizability: 366.1280692|-6.1144936|196.751501|-0.026299|0.017822|91.0603495 unknown
InChI: InChI=1S/C16H18N2O2/c1-11-5-4-6-15(12(11)2)18-16(19)17-13-7-9-14(20-3)10-8-13/h4-10,17-18H,1-3H3
charge 0 multiplicity 1
38 atoms
O  6.398642 0.509025 0.001665
O  -0.124244 1.508051 -0.002395
N  -1.476282 -0.434536 -0.003149
N  0.844777 -0.640744 -0.00361
C  -3.885274 -0.808325 0.000047
C  -2.790759 0.117681 -0.001329
C  -5.217508 -0.305567 0.001804
C  -3.021789 1.517584 -0.000924
C  -5.435055 1.095889 0.002184
C  -3.604246 -2.305294 -0.000385
C  -4.346816 1.99287 0.000836
C  -6.420974 -1.238394 0.003322
C  2.234244 -0.31977 -0.002255
C  -0.244802 0.24833 -0.004363
C  3.153672 -1.398717 -0.001697
C  2.735453 1.012489 -0.001465
C  5.037351 0.154549 0.000373
C  4.547107 -1.17371 -0.000406
C  4.122779 1.236156 -0.000164
C  7.375375 -0.579954 0.002163
H  -2.170425 2.199081 -0.001977
H  -6.4622 1.478181 0.003548
H  -3.03348 -2.620806 -0.898802
H  -3.030912 -2.620833 0.896384
H  -4.534238 -2.892093 0.000931
H  -1.443212 -1.454727 -0.003247
H  -4.527217 3.073581 0.001148
H  -6.43953 -1.894804 -0.887664
H  -6.437256 -1.894825 0.894338
H  -7.358454 -0.657287 0.004524
H  0.644143 -1.642928 -0.003838
H  2.784069 -2.433059 -0.002293
H  2.033581 1.847465 -0.001927
H  5.225073 -2.032062 -0.000032
H  4.520242 2.255717 0.000441
H  8.358296 -0.086178 0.003109
H  7.277872 -1.211911 -0.902866
H  7.276396 -1.212426 0.906673
