program: Gaussian 09
title: 000295016
version: EM64L-G09RevD.01
frameworkgroup: C1[X(C13H20N2O)]
method: RPBEPBE
basis: SDD
operation: Freq
keyword: #p
keyword: freq=noraman
keyword: PBEPBE/SDD
title: #p freq=noraman PBEPBE/SDD
converged: YES YES NO NO
title: Mulliken charges:
elementType: O N N C C C C C C C C C C C C C H H H H H H H H H H H H H H H H H H H H
charge: -0.281735 -0.410926 -0.515516 -0.322922 -0.384764 -0.353301 0.171576 0.333981 0.368843 -0.685638 0.257409 -0.422028 -0.413977 -0.236983 -0.844373 -0.827699 0.213131 0.193003 0.204174 0.261970 0.191260 0.189746 0.285574 0.287532 0.213707 0.214926 0.210950 0.229358 0.230181 0.223387 0.245477 0.216456 0.237793 0.214622 0.287251 0.217555
chargesum: 0.00000
title: Mulliken charges with hydrogens summed into heavy atoms:
elementType: O N N C C C C C C C C C C C C C
charge: -0.281735 -0.125352 -0.227983 0.083212 0.081380 0.027705 0.171576 0.333981 0.368843 -0.046054 0.257409 -0.192671 -0.183796 -0.013596 -0.144648 -0.108272
polarizability: 2.15352634e+02 3.17934577e+00 1.62735815e+02 1.33441892e+01 -1.58822537e+00 1.04899965e+02
1716.lowfreq: -5.6766 -3.0132 -0.0006 0.0006 0.0008 2.7828 11.0803 36.3753 52.0202
frequency: 8.4722 36.0757 51.9415 59.8254 75.3822 93.5229 121.6663 154.5293 175.7238 187.8276 213.2917 221.0351 231.6138 244.0275 278.1008 299.3998 312.8043 324.2893 355.1361 401.4704 464.6708 498.4656 512.0852 515.0647 527.3040 539.1857 558.1718 670.1483 689.3053 717.0061 733.3871 753.2230 775.4053 825.1099 828.4313 857.0630 896.9291 909.1302 930.8172 970.1732 974.4185 985.5072 995.2739 1037.7312 1043.8551 1050.6502 1052.9030 1094.9929 1115.1427 1126.0385 1132.5544 1175.5798 1206.8037 1226.8658 1234.9218 1260.1603 1262.4681 1282.5822 1285.6032 1309.8499 1350.2226 1362.5197 1369.2672 1389.6040 1394.8548 1397.2252 1433.2877 1448.2498 1454.8474 1456.0607 1457.6660 1467.1255 1472.3024 1472.6009 1475.7133 1482.4024 1485.0753 1489.2551 1495.7622 1604.2649 1607.0088 1646.6887 2953.4359 2955.6837 2972.5650 2974.9760 2977.5306 2980.4733 3000.6358 3032.6204 3040.4576 3060.0958 3069.7687 3071.6689 3072.8433 3084.8400 3087.1989 3119.2061 3128.9208 3155.2349 3514.1963 3558.3675
redmass: 3.6534 3.5739 3.7251 2.0985 2.9500 3.6393 3.0767 3.6118 1.1018 1.1767 1.6008 2.0977 2.0564 2.9487 2.4795 3.4560 2.8508 2.4663 1.5495 2.5017 2.8253 2.5875 2.7163 3.0020 2.0051 4.2077 3.0462 4.0030 4.5175 6.2335 1.4935 2.3923 1.2201 2.2067 2.5742 2.2985 1.3113 2.0002 1.9908 1.3419 1.7250 1.5870 2.8048 1.7018 1.6722 2.6369 1.6039 1.8873 2.2491 2.5831 1.8639 1.1595 1.9099 1.4017 3.3727 1.6854 1.3766 2.0589 1.2135 1.2553 1.5107 1.5818 3.3922 1.2137 1.2624 1.2466 1.8514 1.5127 1.3076 1.1014 1.2295 1.4127 1.0949 1.0821 1.0429 1.4841 1.1003 1.3302 1.5452 6.4457 5.9946 5.1861 1.0434 1.0589 1.0514 1.0456 1.0363 1.0666 1.0989 1.0911 1.1011 1.0968 1.0978 1.1003 1.0994 1.1000 1.0975 1.0855 1.0919 1.0995 1.0754 1.0772
irintensity: 0.3893 0.9441 0.8635 1.9275 2.3101 5.4891 2.0672 6.1779 1.2567 1.1383 3.7971 3.0794 4.9497 1.5214 4.5122 5.6345 2.3121 4.0011 24.8784 16.1157 12.7557 12.7008 38.7643 7.2875 118.7209 1.1593 37.8647 4.0963 1.4608 29.1382 13.4400 2.1509 56.2438 2.2136 0.7379 2.8729 0.2310 4.1124 9.3224 0.9502 9.2995 4.9899 3.1989 5.4495 3.2056 1.1877 9.5895 17.4995 4.9902 3.8628 1.8033 4.5883 213.4645 30.4192 66.5578 0.7501 90.6119 22.6074 3.8251 38.8572 5.7520 11.0574 34.0459 9.4979 28.3083 10.5442 31.2092 53.3337 53.8281 6.3209 7.1350 11.6275 18.8387 28.2690 8.8542 358.3641 40.2215 9.6761 230.7785 6.1697 2.0551 144.5660 39.9439 28.4975 21.2348 64.4811 23.4054 53.9081 7.7922 21.7733 57.2195 12.0602 17.6796 63.5288 56.1634 21.8225 20.4266 0.2712 28.5002 35.6781 8.9501 14.3554
temp: 298.150 k
press: 1.00000 atm
elementType: 8 7 7 6 6 6 6 6 6 6 6 6 6 6 6 6 1 1 1 1 1 1 1 1 1 1 1 1 1 1 1 1 1 1 1 1
symmnumber: 1
zpe: 806844.3 jmol-1
zpe.correction: 0.307311 hartree
zpe.thermalcorrener: 0.325131 hartree
zpe.thermalcorrenthalpy: 0.326076 hartree
zpe.thermalcorrgfe: 0.259538 hartree
zpe.sumelectzpe: -690.913293 hartree
zpe.sumelectthermal: -690.895473 hartree
zpe.sumelectthermalent: -690.894529 hartree
zpe.sumelectthermalfe: -690.961066 hartree
dipole: -2.1469 2.0595 -3.2044
dipole: 4.3725
quadrupole: -88.0906 -93.4255 -100.3669
quadrupole: 1.4728 3.7157 1.8562
quadrupole: 5.8704 0.5355 -6.4059 1.4728 3.7157 1.8562
hfenergy: -691.2206041 hartree
pointgroup: C01 [X(C13H20N2O1)]
dipole: -0.8418224 -0.6715956 1.3414991 debye
polarizability: 214.9969318|-5.2188508|161.9900937|-13.9965102|-7.002086|106.001389 unknown
InChI: InChI=1S/C13H20N2O/c1-4-5-9-14-13(16)15-12-10(2)7-6-8-11(12)3/h6-8,14-15H,4-5,9H2,1-3H3
charge 0 multiplicity 1
36 atoms
O  -0.450038 1.261821 -1.155647
N  -1.914609 0.771842 0.605788
N  0.294204 -0.015309 0.689088
C  -4.123243 0.398419 -0.568728
C  -3.076644 1.405325 -0.037592
C  -4.814237 -0.435826 0.533841
C  1.667665 -0.177568 0.306372
C  2.181157 -1.507789 0.219549
C  2.50508 0.954205 0.077666
C  -5.882763 -1.397994 -0.029401
C  -0.673032 0.713704 -0.035951
C  3.542822 -1.693535 -0.112542
C  3.857782 0.720175 -0.275938
C  4.379658 -0.586517 -0.372038
C  1.27859 -2.705231 0.465682
C  1.997426 2.372845 0.227697
H  -3.631769 -0.274942 -1.298167
H  -4.893708 0.967444 -1.12907
H  -3.553863 2.099663 0.682948
H  -2.674988 2.005424 -0.872556
H  -5.284375 0.249292 1.270164
H  -4.052876 -1.023199 1.087671
H  -2.011193 0.426352 1.560781
H  -0.053024 -0.666976 1.396601
H  -5.433477 -2.113206 -0.743608
H  -6.36842 -1.981382 0.774321
H  -6.672186 -0.840167 -0.567234
H  3.941377 -2.712536 -0.183347
H  4.509001 1.582804 -0.460211
H  5.430597 -0.741544 -0.639932
H  0.364405 -2.655703 -0.155427
H  0.95428 -2.781281 1.524683
H  1.803436 -3.644831 0.225156
H  2.837576 3.083597 0.308925
H  1.370127 2.654782 -0.637251
H  1.361361 2.477946 1.126706
