program: Gaussian 09
title: 000295015
version: EM64L-G09RevD.01
frameworkgroup: C1[X(C14H22N2O)]
method: RPBEPBE
basis: SDD
operation: Freq
keyword: #p
keyword: freq=noraman
keyword: PBEPBE/SDD
title: #p freq=noraman PBEPBE/SDD
converged: YES YES NO NO
title: Mulliken charges:
elementType: O N N C C C C C C C C C C C C C C H H H H H H H H H H H H H H H H H H H H H H
charge: -0.297918 -0.422372 -0.499253 -0.328151 -0.387357 0.320120 0.279701 -0.352089 0.377920 0.351388 -0.570382 -0.631376 0.280166 -0.685541 -0.860161 -0.824850 -0.822488 0.219948 0.192492 0.204929 0.260177 0.190530 0.189786 0.309013 0.229354 0.281491 0.305702 0.215187 0.214531 0.210382 0.247287 0.222592 0.223697 0.220054 0.241235 0.221111 0.223717 0.223032 0.226394
chargesum: 0.00000
title: Mulliken charges with hydrogens summed into heavy atoms:
elementType: O N N C C C C C C C C C C C C C C
charge: -0.297918 -0.140881 -0.193551 0.084289 0.077749 0.320120 0.279701 0.028228 0.377920 0.351388 -0.261369 -0.402022 0.280166 -0.045441 -0.166585 -0.142449 -0.149346
polarizability: 2.51174929e+02 -5.03089187e+00 1.75262993e+02 1.77174565e+01 -2.71555777e+00 1.11681686e+02
1716.lowfreq: -4.0573 -0.0007 0.0002 0.0006 5.7900 10.1368 12.3039 28.3765 46.6542
frequency: 11.9471 28.3485 46.6497 63.5511 76.8821 101.2956 109.7027 116.7780 129.2442 148.8635 179.3094 210.3999 214.4895 233.4050 242.0058 258.7905 268.0779 286.5903 298.0679 327.4561 336.4819 371.9991 390.9793 455.8175 457.6124 505.8984 508.2212 558.7471 561.0008 621.8214 676.0569 692.3505 704.3601 736.8279 737.2841 744.0837 822.9879 835.3601 864.4980 875.1291 920.5913 925.5743 972.7106 977.4483 992.5617 1003.6274 1021.2444 1029.2782 1042.1315 1049.6856 1054.1802 1081.7931 1116.0991 1130.2095 1141.9081 1187.6660 1207.7096 1215.3309 1229.8584 1262.7598 1277.5821 1287.9905 1311.0843 1317.4226 1349.2886 1364.1043 1373.2815 1390.2523 1392.5538 1393.2723 1403.2802 1411.1536 1446.2229 1455.0505 1457.5860 1462.5095 1471.7114 1472.6270 1476.0477 1479.1807 1479.5261 1481.4996 1483.4777 1486.2906 1500.2813 1523.3219 1588.8187 1634.3387 1644.2936 2944.8143 2955.4025 2964.0234 2967.6461 2974.8728 2976.1921 2985.3391 3000.8067 3010.3945 3034.1999 3039.0071 3043.6265 3071.7883 3073.4308 3075.7641 3076.4135 3082.6906 3087.9871 3109.6263 3177.6602 3538.1513 3555.0768
redmass: 3.6579 3.6905 5.2869 3.7851 1.7712 3.1694 1.6639 1.5272 2.6747 1.3290 1.4956 1.7642 1.6331 2.1355 1.5140 2.4877 2.6772 2.5006 2.4896 3.7791 1.7198 3.3957 2.9172 2.8251 4.2419 2.6658 3.0154 4.4156 1.2404 3.6267 4.1864 3.2851 9.5233 3.1971 2.4495 1.6986 1.8684 2.6267 2.0356 1.3072 1.7499 1.3246 1.7298 1.5150 2.6560 1.4752 1.5892 1.4409 1.5144 3.0809 1.6347 3.3277 2.1183 2.1772 2.6789 3.1845 1.7883 1.7328 1.3794 1.3385 1.2829 1.1048 1.2767 5.0359 1.4800 1.5589 3.2034 1.2911 1.2774 1.2131 1.2818 3.0248 1.2125 1.3119 1.1334 1.0476 1.1835 1.0814 1.0496 1.0435 1.1539 1.0535 1.5057 1.0876 1.6045 2.5175 5.6447 6.1988 4.1476 1.0401 1.0587 1.0374 1.0383 1.0394 1.0577 1.0668 1.0987 1.0978 1.0970 1.0967 1.1009 1.1001 1.0996 1.0981 1.0981 1.0940 1.0977 1.0909 1.0922 1.0756 1.0768
irintensity: 0.0877 0.0253 8.6784 4.7439 1.3790 1.7629 0.3220 0.5402 0.9403 3.9344 1.6835 1.4818 1.1694 3.1895 0.3900 1.3979 0.3647 0.1918 4.1750 6.0342 23.1733 8.3634 13.5951 16.5633 0.4201 1.8696 1.4057 1.2153 161.7076 8.4916 1.6293 4.9495 9.9903 4.3503 6.9704 6.8858 1.7775 1.5088 2.4468 11.5511 7.8163 16.6778 13.3344 0.4806 0.1833 24.3511 1.5375 12.3828 12.1554 2.5746 0.5684 4.6779 3.9601 5.1490 6.7955 37.5915 84.4990 160.1393 47.8858 78.8108 26.7271 2.2157 57.3670 14.4065 7.1491 14.6149 51.7206 11.3816 5.4748 8.7977 14.1358 64.5551 48.2624 61.3102 15.3160 0.2011 21.4619 33.0021 25.1803 5.5171 3.0408 27.1770 472.5612 35.1124 18.4460 394.6523 99.7912 9.6166 128.8891 49.9698 31.1357 67.7427 29.6922 22.8773 60.4722 54.5256 8.4666 27.1106 45.3455 5.0245 59.2014 68.8393 45.1520 20.1300 25.9850 16.9747 16.3731 29.2817 6.5219 14.1002 15.8312
temp: 298.150 k
press: 1.00000 atm
elementType: 8 7 7 6 6 6 6 6 6 6 6 6 6 6 6 6 6 1 1 1 1 1 1 1 1 1 1 1 1 1 1 1 1 1 1 1 1 1 1
symmnumber: 1
zpe: 878840.8 jmol-1
zpe.correction: 0.334733 hartree
zpe.thermalcorrener: 0.354320 hartree
zpe.thermalcorrenthalpy: 0.355264 hartree
zpe.thermalcorrgfe: 0.285009 hartree
zpe.sumelectzpe: -730.146251 hartree
zpe.sumelectthermal: -730.126664 hartree
zpe.sumelectthermalent: -730.125720 hartree
zpe.sumelectthermalfe: -730.195976 hartree
dipole: -1.5810 3.7519 -0.2196
dipole: 4.0773
quadrupole: -88.6408 -99.9790 -106.9230
quadrupole: -4.1706 4.1242 -3.2580
quadrupole: 9.8734 -1.4647 -8.4087 -4.1706 4.1242 -3.2580
hfenergy: -730.480984 hartree
pointgroup: C01 [X(C14H22N2O1)]
dipole: -0.5826831 -1.4945538 0.0045095 debye
polarizability: 251.2651874|7.9098628|175.7419752|-15.5141058|0.1160089|111.1124457 unknown
InChI: InChI=1S/C14H22N2O/c1-5-6-7-15-14(17)16-13-9-11(3)10(2)8-12(13)4/h8-9,15-16H,5-7H2,1-4H3
charge 0 multiplicity 1
39 atoms
O  -1.13766 1.611018 0.635259
N  -2.543769 -0.233354 0.915659
N  -0.268601 -0.589379 0.489649
C  -4.621435 0.711422 -0.177971
C  -3.747898 0.594304 1.093855
C  1.109717 -0.352582 0.216074
C  1.953065 -1.494223 0.053592
C  -5.23387 -0.627498 -0.647239
C  3.028385 1.147034 -0.171827
C  3.885394 0.019018 -0.336564
C  1.655933 0.951338 0.101932
C  3.321829 -1.273583 -0.218685
C  -1.296497 0.352731 0.672784
C  -6.128612 -0.469054 -1.895638
C  1.406092 -2.908591 0.167317
C  3.575026 2.559795 -0.284934
C  5.365181 0.190227 -0.631282
H  -4.01034 1.152074 -0.989577
H  -5.438945 1.431544 0.032727
H  -4.346794 0.175308 1.926888
H  -3.39379 1.59517 1.394882
H  -5.827104 -1.069439 0.180557
H  -4.420207 -1.346978 -0.87468
H  0.990322 1.807255 0.231317
H  3.974354 -2.147315 -0.344549
H  -2.654501 -1.247461 0.891728
H  -0.526234 -1.574189 0.567583
H  -5.551727 -0.057006 -2.744597
H  -6.556623 -1.43717 -2.21457
H  -6.968388 0.222738 -1.695123
H  2.209767 -3.648039 0.015856
H  0.967996 -3.112533 1.166609
H  0.626664 -3.121351 -0.593593
H  4.038877 2.739065 -1.274382
H  2.776818 3.307467 -0.144765
H  4.359143 2.754762 0.472655
H  5.53379 0.734338 -1.58122
H  5.875666 0.772727 0.160288
H  5.872574 -0.786786 -0.709715
