program: Gaussian 09
title: 000295004
version: EM64L-G09RevD.01
frameworkgroup: C1[X(C14H10ClF3N2O)]
method: RPBEPBE
basis: SDD
operation: Freq
keyword: #p
keyword: freq=noraman
keyword: PBEPBE/SDD
title: #p freq=noraman PBEPBE/SDD
converged: YES YES NO NO
title: Mulliken charges:
elementType: Cl F F F O N N C C C C C C C C C C C C C C H H H H H H H H H H
charge: -0.052564 -0.166337 -0.161765 -0.161748 -0.279267 -0.504938 -0.497110 0.634598 0.339297 -0.402603 -0.391839 -0.408212 -0.197357 0.248531 0.482340 0.277644 -0.448326 -0.330372 -0.196465 -0.214192 -0.254627 0.340512 0.274216 0.298936 0.263353 0.296756 0.215921 0.306861 0.228184 0.229215 0.231359
chargesum: 0.00000
title: Mulliken charges with hydrogens summed into heavy atoms:
elementType: Cl F F F O N N C C C C C C C C C C C C C C
charge: -0.052564 -0.166337 -0.161765 -0.161748 -0.279267 -0.206002 -0.200354 0.634598 0.339297 -0.062092 -0.391839 -0.133997 0.065996 0.248531 0.482340 0.277644 -0.232404 -0.023511 0.031719 0.015023 -0.023269
polarizability: 3.05386248e+02 1.07927716e+01 2.03274513e+02 -5.12982497e-04 5.12607137e-03 7.46990706e+01
1716.lowfreq: -18.6676 -8.0353 -3.5730 0.0014 0.0017 0.0021 4.1150 13.8570 33.4585
frequency: -18.4669 12.9604 33.4477 49.5969 72.1407 76.8784 90.9019 125.6051 156.7979 171.8772 214.5583 234.4707 257.5919 260.5461 285.6950 336.6006 351.2477 359.6613 406.6884 410.9985 435.3494 466.0264 467.6646 493.2571 522.9669 536.7090 538.0710 613.7986 625.2549 632.5388 635.8641 657.7144 695.6384 704.0454 714.7944 726.2080 766.8899 769.0701 816.9509 826.7057 840.9174 906.6443 915.9542 934.0811 950.8429 972.3880 983.5949 992.8183 994.7125 1000.0604 1013.1836 1018.0511 1031.1860 1062.2746 1091.8757 1153.7614 1173.4585 1181.8374 1190.4345 1232.9299 1252.4994 1262.3561 1310.7986 1322.4878 1380.4200 1385.9114 1429.3009 1431.8266 1452.4472 1486.8935 1517.4695 1528.4832 1593.1950 1604.0978 1613.3966 1616.9185 1657.4352 3106.5250 3134.7311 3146.9609 3167.4633 3171.0577 3180.5038 3190.8546 3200.2361 3479.8859 3523.8793
redmass: 17.9451 4.1093 6.5312 8.9170 8.3463 6.4221 5.8665 9.0331 9.9226 6.4566 8.8904 3.3942 15.4356 5.0957 10.0072 8.6574 7.9764 9.5618 2.9228 7.2674 3.4191 10.4539 2.3768 3.3951 8.3364 8.4654 2.0760 6.4593 8.4475 3.1978 9.8298 1.5135 1.9937 7.9115 8.0537 3.9029 1.6814 7.0770 1.3372 6.2431 1.2683 6.9925 1.4265 1.4242 1.3622 1.3535 6.2326 10.1171 7.6173 1.3093 5.7703 6.4474 2.2179 2.9482 1.5644 1.4358 1.0616 2.4353 1.1229 2.0959 1.7255 2.2695 2.1647 1.5111 6.1825 7.3838 3.1725 3.2697 2.6189 2.3848 2.0697 2.3020 5.7351 5.3296 6.9256 6.0558 3.8091 1.0890 1.0867 1.0932 1.0999 1.0894 1.0930 1.0974 1.0948 1.0763 1.0761
irintensity: 0.0103 0.7574 0.4322 0.0032 1.0290 6.1344 2.9440 0.0912 5.4670 0.3880 5.2270 2.2190 1.5875 0.7227 1.8415 0.9130 3.0877 10.7215 0.0223 9.5741 3.0358 26.3192 4.9546 26.8027 10.9925 7.6419 1.8666 0.5827 2.9193 9.0385 1.5200 81.4836 47.3758 52.6057 3.8542 1.0620 101.6165 1.6865 64.5260 17.4781 0.2713 55.3835 10.7186 59.1014 0.4237 0.1215 5.2394 209.6857 83.1796 4.9672 83.8761 77.1748 0.6862 97.4022 16.8671 11.3244 3.0095 292.3984 13.0533 112.7257 128.0900 103.3110 178.5727 50.9364 64.5808 200.1064 30.4178 404.9862 29.5780 116.2304 923.4567 69.8737 33.1667 60.6410 163.4384 5.3977 121.6404 17.3945 0.1776 27.3531 26.0980 0.3690 26.3567 0.6590 7.5904 46.1804 19.5783
temp: 298.150 k
press: 1.00000 atm
elementType: 17 9 9 9 8 7 7 6 6 6 6 6 6 6 6 6 6 6 6 6 6 1 1 1 1 1 1 1 1 1 1
symmnumber: 1
zpe: 564295.4 jmol-1
zpe.correction: 0.214929 hartree
zpe.thermalcorrener: 0.232641 hartree
zpe.thermalcorrenthalpy: 0.233585 hartree
zpe.thermalcorrgfe: 0.166570 hartree
zpe.sumelectzpe: -1482.351983 hartree
zpe.sumelectthermal: -1482.334271 hartree
zpe.sumelectthermalent: -1482.333326 hartree
zpe.sumelectthermalfe: -1482.400342 hartree
dipole: -2.7692 5.6008 -0.0012
dipole: 6.2480
quadrupole: -113.7891 -125.0267 -134.0432
quadrupole: 7.3055 -0.0078 0.0070
quadrupole: 10.4972 -0.7404 -9.7569 7.3055 -0.0078 0.0070
hfenergy: -1482.5669118 hartree
pointgroup: C01 [X(C14H10Cl1F3N2O1)]
dipole: 1.0829677 2.2067384 -0.0006833 debye
polarizability: 305.4489901|-10.4915828|203.2117316|0.0031499|-0.0718749|74.6991106 unknown
InChI: InChI=1S/C14H10ClF3N2O/c15-11-7-6-9(14(16,17)18)8-12(11)20-13(21)19-10-4-2-1-3-5-10/h1-8,19-20H
charge 0 multiplicity 1
31 atoms
Cl -1.420766 3.867852 -0.001835
F  -5.338512 -1.697711 0.005916
F  -3.536874 -2.474154 -1.132238
F  -3.528852 -2.477178 1.129271
O  0.852888 -0.969181 -0.000411
N  0.086863 1.263769 -0.001824
N  2.376029 0.832122 -0.0017
C  -1.305339 1.057178 -0.000962
C  -3.326379 -0.330304 0.000688
C  -1.919112 -0.223738 -0.000184
C  -2.168128 2.192557 -0.00085
C  -4.160877 0.808315 0.000805
C  -3.5649 2.087305 0.000043
C  -3.924656 -1.710116 0.000979
C  3.628731 0.148608 -0.00055
C  1.095282 0.271032 -0.001875
C  4.798705 0.955989 -0.000717
C  3.749408 -1.266177 0.000743
C  6.075128 0.359224 0.000389
C  5.036303 -1.846718 0.001846
C  6.20307 -1.049194 0.001687
H  -1.274295 -1.105451 -0.000187
H  -5.248408 0.705598 0.001545
H  0.364395 2.250394 -0.002263
H  -4.180091 2.990644 0.000139
H  2.451255 1.851935 -0.002323
H  4.71009 2.050816 -0.001715
H  2.85068 -1.884486 0.000849
H  6.967443 0.994652 0.000242
H  5.12231 -2.939001 0.002839
H  7.19411 -1.514582 0.002555
