program: Gaussian 09
title: 000294995
version: EM64L-G09RevD.01
frameworkgroup: C1[X(C20H14F2N2O2)]
method: RPBEPBE
basis: SDD
operation: Freq
keyword: #p
keyword: freq=noraman
keyword: PBEPBE/SDD
title: #p freq=noraman PBEPBE/SDD
converged: YES YES NO NO
title: Mulliken charges:
elementType: F F O O N N C C C C C C C C C C C C C C C C C C C C H H H H H H H H H H H H H H
charge: -0.204494 -0.204494 -0.253732 -0.253741 -0.476546 -0.476545 0.280362 0.280349 -0.520739 -0.355592 -0.355594 0.093935 0.093950 -0.213835 0.510459 0.510458 -0.306554 -0.422223 -0.306552 -0.422218 -0.364719 -0.343381 -0.364723 -0.343381 0.319092 0.319093 0.226400 0.279437 0.279442 0.242577 0.318084 0.318085 0.314975 0.227115 0.314976 0.227115 0.258369 0.258212 0.258370 0.258213
chargesum: 0.00000
title: Mulliken charges with hydrogens summed into heavy atoms:
elementType: F F O O N N C C C C C C C C C C C C C C C C C C C C
charge: -0.204494 -0.204494 -0.253732 -0.253741 -0.158462 -0.158461 0.280362 0.280349 -0.294340 -0.076155 -0.076152 0.093935 0.093950 0.028742 0.510459 0.510458 0.008421 -0.195109 0.008423 -0.195104 -0.106350 -0.085169 -0.106353 -0.085169 0.319092 0.319093
polarizability: 3.43275565e+02 -1.27049575e-03 3.01372355e+02 -3.31087296e+01 -5.12240210e-04 1.33299441e+02
1716.lowfreq: -4.1512 -3.4426 -0.0007 -0.0007 -0.0005 3.2463 17.0391 26.0300 27.4836
frequency: 16.9998 26.0300 27.4015 44.3146 47.9567 66.2498 77.4242 79.0594 129.3511 137.8737 163.2390 176.4467 207.3060 230.3216 248.7231 279.1077 312.5736 323.3042 352.6691 371.3708 371.7247 396.5728 406.6073 413.2957 414.7931 418.2321 465.3574 475.2124 514.8844 516.3970 526.0254 544.7347 625.3641 625.4239 630.2278 640.7232 653.8608 670.7829 707.3284 711.2091 711.3748 719.5602 735.5326 751.0320 768.9784 807.2443 808.3367 823.8429 833.1857 841.3659 844.6645 844.6848 861.0094 907.8284 913.2979 929.0426 929.3724 959.5459 977.2417 977.2549 987.9638 1000.6523 1000.6727 1010.5960 1072.1902 1087.3849 1109.3162 1112.5871 1119.1367 1157.5643 1158.0921 1181.0790 1197.6747 1197.9099 1218.6307 1261.1137 1262.8022 1269.6469 1295.7187 1298.5810 1310.0411 1369.3834 1373.7711 1386.8546 1408.8459 1409.2820 1413.3240 1467.7254 1494.5652 1495.3684 1507.1939 1509.9687 1580.4105 1587.6441 1604.8092 1605.2650 1612.0796 1612.5724 1618.2399 1618.3689 3105.6724 3122.3852 3122.4381 3146.2724 3163.0511 3171.6074 3171.6175 3174.8082 3178.8843 3178.8960 3201.1622 3201.1831 3527.3010 3527.6192
redmass: 8.4865 5.2759 4.1944 6.5552 6.7494 6.1512 7.5805 8.0808 7.5898 6.3840 6.2058 7.1247 5.8804 7.2758 7.2772 6.1614 10.3599 8.4178 8.0552 5.6274 6.2443 5.2775 5.0732 3.1590 3.1074 3.3144 7.4583 6.9577 2.7503 2.6190 5.3916 5.9606 6.8073 6.2923 1.2696 1.7254 2.5357 5.5688 3.9710 3.1846 3.7692 2.7546 7.5875 6.5081 6.4171 1.3394 1.3351 6.7762 2.8661 2.0160 1.5036 1.5056 6.9218 1.8524 4.4260 1.3631 1.3610 1.4025 1.3101 1.3095 6.2226 2.8620 2.8408 1.3742 2.8636 2.1838 1.4100 1.3057 1.7986 1.4769 1.4752 1.0908 1.8045 1.8306 2.6764 2.1012 2.4420 3.2475 1.4091 1.5206 1.3116 5.7335 6.2356 9.5562 4.3519 4.3030 3.1360 2.3605 2.5073 2.7555 2.1449 2.3684 6.0383 6.9448 8.0190 6.8049 4.6537 4.8224 6.2772 6.5215 1.0901 1.0904 1.0904 1.0874 1.0924 1.0913 1.0913 1.0993 1.0952 1.0952 1.0956 1.0956 1.0762 1.0761
irintensity: 0.0025 0.9488 2.7155 0.2120 0.2380 0.3428 1.2357 13.7987 1.6391 1.0761 0.1694 4.6754 0.0760 0.0179 3.4253 4.4437 7.7393 4.0391 0.0008 5.4192 0.0480 1.7543 2.0951 1.5741 0.0202 2.1804 14.3429 12.2615 25.5295 69.5166 16.3034 1.1900 0.2021 3.6748 66.9662 23.1780 1.6525 27.6342 6.7992 10.4822 0.0916 40.1825 2.6336 13.4554 33.5435 41.3365 11.7507 18.5570 18.4441 13.2019 138.8914 34.3163 5.2681 18.8827 2.2493 0.6564 0.0607 1.9478 1.0342 5.1632 2.4450 4.6938 8.8435 1.8630 40.7432 17.3565 7.7842 31.3411 0.8794 70.9898 38.2809 7.2035 59.2134 62.3928 183.9475 32.6977 0.0199 26.0610 14.5703 40.4132 3.8672 119.5199 146.9048 0.7329 9.4964 27.5677 0.0120 11.3686 53.0173 316.7659 311.4295 609.9198 40.7590 95.6289 38.5622 3.7313 21.1809 91.3056 4.6027 2.5413 11.1212 26.4055 0.9216 7.2830 0.1258 3.1306 1.3748 10.1423 1.3582 3.3670 5.7053 11.1417 3.9232 16.6016
temp: 298.150 k
press: 1.00000 atm
elementType: 9 9 8 8 7 7 6 6 6 6 6 6 6 6 6 6 6 6 6 6 6 6 6 6 6 6 1 1 1 1 1 1 1 1 1 1 1 1 1 1
symmnumber: 1
zpe: 771404.7 jmol-1
zpe.correction: 0.293813 hartree
zpe.thermalcorrener: 0.315548 hartree
zpe.thermalcorrenthalpy: 0.316492 hartree
zpe.thermalcorrgfe: 0.239675 hartree
zpe.sumelectzpe: -1228.407744 hartree
zpe.sumelectthermal: -1228.386009 hartree
zpe.sumelectthermalent: -1228.385065 hartree
zpe.sumelectthermalfe: -1228.461881 hartree
dipole: -0.0001 0.0973 -0.0003
dipole: 0.0973
quadrupole: -191.1971 -149.3506 -149.7373
quadrupole: -0.0006 5.5602 -0.0007
quadrupole: -27.7687 14.0777 13.6910 -0.0006 5.5602 -0.0007
hfenergy: -1228.7015567 hartree
pointgroup: C01 [X(C20H14F2N2O2)]
dipole: -0.0000562 0.0382817 -0.0001058 debye
polarizability: 333.9833283|-0.0191057|301.3723409|-54.414977|-0.0482088|142.5916924 unknown
InChI: InChI=1S/C20H14F2N2O2/c21-15-4-8-17(9-5-15)23-19(25)13-2-1-3-14(12-13)20(26)24-18-10-6-16(22)7-11-18/h1-12,23-24H
charge 0 multiplicity 1
40 atoms
F  -6.846309 -3.293454 0.536879
F  6.846173 -3.294103 -0.534733
O  -3.336572 2.240444 1.427509
O  3.3367 2.239406 -1.428681
N  -2.683183 0.467599 0.028112
N  2.683148 0.467385 -0.028315
C  -1.193373 2.39407 0.301964
C  1.193457 2.393785 -0.303341
C  0.000018 1.69036 -0.000456
C  -1.17778 3.811467 0.328412
C  1.177969 3.811168 -0.330694
C  -2.491785 1.705944 0.645421
C  2.491817 1.705358 -0.646383
C  0.000121 4.514144 -0.001368
C  -3.764809 -0.445878 0.191554
C  3.764756 -0.446223 -0.191168
C  -4.836286 -0.223752 1.099757
C  -3.743229 -1.628121 -0.598267
C  4.836245 -0.224687 -1.099501
C  3.743142 -1.627977 0.599384
C  -5.865432 -1.18194 1.212946
C  -4.770896 -2.585211 -0.48919
C  5.865363 -1.182974 -1.212101
C  4.770782 -2.585164 0.490896
C  -5.814071 -2.340147 0.420477
C  5.813964 -2.340692 -0.418921
H  -0.000029 0.592103 -0.000102
H  -2.098218 4.336349 0.603068
H  2.098447 4.335798 -0.605693
H  0.000162 5.608829 -0.001724
H  -1.997527 0.206404 -0.684178
H  1.997449 0.206636 0.684097
H  -4.855353 0.690983 1.693614
H  -2.921043 -1.803421 -1.303457
H  4.85534 0.689681 -1.69392
H  2.92095 -1.802817 1.304682
H  -6.698795 -1.030398 1.904946
H  -4.767763 -3.498095 -1.091016
H  6.69873 -1.031882 -1.904193
H  4.767621 -3.497676 1.093285
