program: Gaussian 09
title: 000294987
version: EM64L-G09RevD.01
frameworkgroup: C1[X(C16H17ClN2O)]
method: RPBEPBE
basis: SDD
operation: Freq
keyword: #p
keyword: freq=noraman
keyword: PBEPBE/SDD
title: #p freq=noraman PBEPBE/SDD
converged: YES YES NO NO
title: Mulliken charges:
elementType: Cl O N N C C C C C C C C C C C C C C C C H H H H H H H H H H H H H H H H H
charge: -0.077901 -0.294420 -0.286203 -0.495828 0.147785 -0.341363 0.343506 0.223003 -0.332022 -0.365197 -0.672633 -0.815975 -0.234850 -0.234692 0.507401 -0.445867 -0.351840 -0.039561 -0.193807 -0.267408 0.257327 0.216453 0.264348 0.220736 0.244174 0.217953 0.237967 0.237392 0.250963 0.229996 0.334056 0.236579 0.233071 0.249739 0.312540 0.229506 0.255074
chargesum: 0.00000
title: Mulliken charges with hydrogens summed into heavy atoms:
elementType: Cl O N N C C C C C C C C C C C C C C C C
charge: -0.077901 -0.294420 -0.286203 -0.161772 0.147785 0.132417 0.343506 0.223003 -0.067674 -0.127230 0.010230 -0.097625 0.001729 -0.001622 0.507401 -0.196128 -0.039301 -0.039561 0.035699 -0.012334
polarizability: 2.48104230e+02 -6.06714517e+00 2.25213827e+02 -7.66191794e+00 -6.08065571e+00 1.38642279e+02
1716.lowfreq: -6.9777 -4.4666 -2.2837 -0.0014 -0.0011 0.0009 18.7800 24.2517 40.4196
frequency: 18.5672 24.2340 40.4018 46.2838 59.4949 86.5397 92.1954 103.7109 119.1802 169.9013 182.8233 197.1556 225.8087 239.2179 246.8390 271.8301 302.3260 352.4617 362.6902 403.9126 411.0927 416.1364 437.0355 465.9291 489.8450 551.9197 558.2401 565.4164 610.9137 626.6734 645.0774 675.7781 683.5198 702.5536 732.0524 749.1679 772.3064 785.3940 791.4675 830.3964 854.2886 857.2879 878.0718 907.1542 936.0022 956.5445 977.0016 979.3640 985.3804 988.4889 993.6509 1041.4862 1045.0744 1069.2094 1077.7297 1093.6129 1095.0055 1116.2862 1144.4501 1174.0231 1174.4091 1205.3044 1245.8069 1257.0373 1267.0731 1280.6289 1305.8834 1346.2202 1355.9192 1366.5333 1375.0345 1383.5241 1399.9457 1414.3409 1432.1411 1450.6937 1461.6155 1469.8005 1474.5864 1475.7609 1482.4508 1484.6887 1512.4669 1579.3434 1582.1208 1605.0400 1614.3677 1621.5546 2977.5288 2984.5113 3011.4561 3059.5319 3071.5721 3083.9688 3096.9769 3101.3697 3123.6852 3135.3603 3141.9179 3143.3810 3148.1166 3166.8012 3178.1918 3198.8651 3507.8321
redmass: 5.3007 3.8384 3.5208 4.0454 4.4138 2.9554 1.3282 4.6974 4.3514 3.8410 5.4410 2.0587 3.1693 2.5248 2.5070 3.7690 3.3146 3.1816 5.0396 6.8701 5.8662 3.7079 3.0523 3.0486 4.3073 5.1069 3.6897 3.9743 5.0005 1.3736 4.9470 6.4945 2.3246 9.2945 2.5231 2.1652 1.4393 1.3123 2.2243 3.2503 5.1588 1.6058 1.3033 1.3662 2.5752 1.4033 5.8165 1.5848 3.6197 1.3096 1.3247 2.1048 1.5507 2.2553 2.3957 1.6444 1.9699 2.0971 1.8217 1.0625 1.0847 2.4102 1.7259 1.8300 3.1835 1.6234 1.6349 1.6979 1.5756 3.7803 4.3963 1.2347 1.2251 3.6928 2.0989 1.1025 1.1177 1.0455 1.9263 1.5329 1.0884 1.8779 2.3541 6.1452 5.8067 6.2072 5.2492 5.6447 1.0408 1.0353 1.0614 1.0921 1.1008 1.0986 1.1002 1.1030 1.0872 1.0884 1.0915 1.0899 1.0943 1.1008 1.0954 1.0952 1.0758
irintensity: 0.1778 0.0644 0.0531 0.2713 1.4322 3.8220 1.1188 1.2565 1.0999 0.6378 0.6524 0.9532 1.9907 0.5585 0.8935 11.6964 4.6414 5.7610 1.9292 15.7351 1.1190 1.1584 6.6425 9.3395 5.6032 5.1641 6.0595 12.2979 3.8048 33.1048 6.6576 15.1006 23.0472 21.9855 17.3840 22.4328 34.8378 55.7646 8.6074 4.0584 29.6927 36.5814 1.7094 3.4541 8.8545 0.0503 16.6772 3.5742 26.2499 4.0838 0.1334 7.9649 12.4128 18.4529 2.7780 44.6678 10.5214 26.9841 53.4398 0.4297 1.8677 3.5250 254.3867 3.0074 119.2262 21.8879 42.2025 13.2833 10.6954 9.7265 216.9746 19.4944 17.2793 76.4226 7.7740 23.1124 6.7078 8.3452 111.7834 55.9592 23.2879 44.7538 518.4990 147.8485 52.8647 17.1923 71.9232 381.8277 21.2075 26.4610 36.2234 16.9246 8.5720 36.2785 15.1589 25.6146 7.4148 3.5677 13.6008 5.3803 22.4397 18.4519 3.1007 9.3417 41.5771
temp: 298.150 k
press: 1.00000 atm
elementType: 17 8 7 7 6 6 6 6 6 6 6 6 6 6 6 6 6 6 6 6 1 1 1 1 1 1 1 1 1 1 1 1 1 1 1 1 1
symmnumber: 1
zpe: 771423.6 jmol-1
zpe.correction: 0.293820 hartree
zpe.thermalcorrener: 0.313243 hartree
zpe.thermalcorrenthalpy: 0.314188 hartree
zpe.thermalcorrgfe: 0.243211 hartree
zpe.sumelectzpe: -1263.276013 hartree
zpe.sumelectthermal: -1263.256590 hartree
zpe.sumelectthermalent: -1263.255646 hartree
zpe.sumelectthermalfe: -1263.326622 hartree
dipole: -4.4254 2.0894 0.1243
dipole: 4.8954
quadrupole: -121.7617 -125.1731 -121.9145
quadrupole: -10.5163 -2.8912 0.1498
quadrupole: 1.1880 -2.2233 1.0353 -10.5163 -2.8912 0.1498
hfenergy: -1263.5698331 hartree
pointgroup: C01 [X(C16H17Cl1N2O1)]
dipole: -1.8384258 -0.5611173 -0.1219568 debye
polarizability: 248.4670256|3.167393|223.4700739|11.9237077|-9.4334396|140.0232356 unknown
InChI: InChI=1S/C16H17ClN2O/c1-3-19(15-10-5-4-7-12(15)2)16(20)18-14-9-6-8-13(17)11-14/h4-11,18H,3H2,1-2H3
charge 0 multiplicity 1
37 atoms
Cl 4.779848 -2.775972 0.359274
O  0.257564 2.658065 -0.211127
N  -1.559552 1.182111 -0.197776
N  0.638191 0.330869 -0.054115
C  -2.108504 -0.140826 0.005698
C  -2.497365 2.330879 -0.302609
C  -2.67918 -0.858017 -1.089362
C  -0.181793 1.46845 -0.148172
C  -2.097436 -0.705447 1.308961
C  -3.229303 -2.140245 -0.829091
C  -2.966539 2.848155 1.072401
C  -2.703448 -0.277012 -2.489928
C  -2.643629 -1.985309 1.541852
C  -3.215743 -2.703257 0.46596
C  2.052258 0.286248 0.028094
C  2.646501 -1.003697 0.135225
C  2.881868 1.441628 0.009943
C  4.04292 -1.106885 0.222615
C  4.280853 1.28877 0.101751
C  4.890281 0.016511 0.209532
H  -1.968479 3.132983 -0.844357
H  -3.362561 2.007262 -0.90934
H  -1.659891 -0.126605 2.130051
H  -3.47346 2.053767 1.649555
H  -2.105807 3.218706 1.655204
H  -3.678934 3.683487 0.940891
H  -3.666495 -2.705577 -1.660948
H  -3.622269 0.317447 -2.661327
H  -1.84627 0.396186 -2.661102
H  -2.684755 -1.075644 -3.251195
H  0.158332 -0.572658 -0.028043
H  -2.630006 -2.413083 2.549931
H  -3.645076 -3.696955 0.634398
H  2.026628 -1.906822 0.150468
H  2.419982 2.426039 -0.076267
H  4.915224 2.181763 0.087677
H  5.975345 -0.095113 0.278973
