program: Gaussian 09
title: 000295002
version: EM64L-G09RevD.01
frameworkgroup: C1[X(C20H18N2O)]
method: RPBEPBE
basis: SDD
operation: Freq
keyword: #p
keyword: freq=noraman
keyword: PBEPBE/SDD
title: #p freq=noraman PBEPBE/SDD
converged: YES YES NO NO
title: Mulliken charges:
elementType: O N N C C C C C C C C C C C C C C C C C C C C H H H H H H H H H H H H H H H H H H
charge: -0.265760 -0.317678 -0.483235 -0.586071 0.431063 0.505310 0.205084 -0.436727 -0.352986 -0.349507 -0.390962 0.468020 -0.221595 -0.226250 -0.219822 -0.218199 -0.237012 -0.252237 -0.442576 -0.337282 -0.201819 -0.216342 -0.260240 0.247233 0.252085 0.243145 0.258457 0.261399 0.231486 0.331563 0.233333 0.232778 0.226522 0.225185 0.233845 0.229478 0.221997 0.305900 0.222509 0.223748 0.226160
chargesum: 0.00000
title: Mulliken charges with hydrogens summed into heavy atoms:
elementType: O N N C C C C C C C C C C C C C C C C C C C C
charge: -0.265760 -0.317678 -0.151671 -0.086753 0.431063 0.505310 0.205084 -0.193583 -0.094529 -0.088108 -0.159476 0.468020 0.011738 0.006528 0.006700 0.006987 -0.003167 -0.022760 -0.220579 -0.031383 0.020690 0.007406 -0.034080
polarizability: 3.19177353e+02 2.49306875e+01 2.21913707e+02 -4.36661613e+00 -9.51362056e+00 1.66176018e+02
1716.lowfreq: -9.9498 -1.7290 0.0005 0.0006 0.0007 4.4396 21.6288 29.7509 34.6701
frequency: 20.9196 29.7386 34.6258 38.1448 51.4152 56.7272 82.7761 99.8531 144.7721 182.2538 198.7854 231.2337 249.9881 253.6452 286.1332 346.7810 362.9257 401.1981 406.4871 407.2785 410.0015 463.5497 501.9003 508.9394 525.1393 576.6866 612.5759 613.5043 614.6144 635.7102 642.4100 666.8937 695.7820 696.0056 705.8093 707.9839 747.0484 765.7821 770.5867 778.4458 798.1300 833.0213 840.4409 852.7411 860.2780 903.4283 907.0995 912.4776 937.8847 963.9887 968.9592 982.3068 983.6341 985.5640 988.9479 989.5634 995.0138 1000.3399 1009.9655 1025.3744 1026.1058 1033.6043 1081.0581 1086.8520 1089.1454 1125.0211 1170.9502 1172.3046 1174.3549 1185.6001 1188.4648 1188.9086 1193.9764 1203.8829 1235.2634 1263.4395 1301.0559 1319.8174 1322.2896 1338.0146 1356.6947 1382.1915 1383.3569 1387.6519 1431.1612 1440.9328 1442.3372 1461.8059 1481.7021 1484.8711 1489.5197 1519.0045 1590.0438 1592.8977 1599.6956 1606.5397 1611.7359 1616.0712 1625.5345 2985.3167 3065.3473 3107.9393 3112.1547 3124.6284 3129.3993 3129.7413 3133.4415 3140.3065 3141.2621 3145.5506 3151.3394 3162.0691 3163.1859 3166.9343 3175.7979 3196.0500 3472.2958
redmass: 4.6876 4.4499 4.4858 4.2099 4.0754 5.2197 6.9406 4.9258 4.6126 5.1277 4.9584 4.8170 5.0976 4.3057 3.6924 6.8017 2.9983 2.9193 3.4397 2.8707 3.9492 3.4810 3.4806 2.8186 6.2067 5.3670 6.1853 6.2245 6.2225 2.0681 2.0246 4.5691 1.8802 2.0095 2.0745 6.4805 1.5834 1.7054 2.0981 4.6458 4.1878 1.2551 1.2754 4.3447 1.3089 1.4647 1.6681 1.4486 2.1411 1.3757 1.3494 1.3930 5.6991 1.9684 5.9482 2.4211 1.3167 1.4052 2.6587 2.2324 2.2261 1.9101 1.7779 1.5722 1.5682 3.7607 1.0523 1.0498 1.0618 1.2921 1.1585 1.1225 2.0502 2.4362 1.9829 2.0967 1.7154 1.4832 1.3297 1.5501 1.5629 7.8805 6.4305 4.7419 2.3922 2.3430 2.1129 1.1586 2.1976 2.1443 2.4092 2.0125 6.3627 6.0364 5.9016 5.4995 5.9520 5.4436 5.8956 1.0660 1.0951 1.0882 1.0883 1.0852 1.0867 1.0860 1.0881 1.0910 1.0934 1.0939 1.0960 1.0977 1.0998 1.1014 1.0982 1.0948 1.0769
irintensity: 0.0294 0.7203 0.1038 0.3148 0.8938 0.5914 3.0555 1.2092 2.2843 5.5072 4.7812 1.1208 0.5471 0.5118 3.3427 6.1598 7.0529 0.5596 0.5048 1.3572 0.7153 9.9639 6.4029 21.2945 8.2304 14.9189 1.1653 1.6131 0.1688 9.7110 17.0319 10.4745 39.7197 37.9210 56.1028 32.0569 37.8385 84.9154 54.5002 13.2173 6.3827 1.3882 0.0681 3.1772 0.2055 3.8151 10.9210 11.4440 23.2516 0.1880 0.1860 0.2365 0.3698 0.0046 0.6729 0.0306 2.2997 1.5360 23.5299 8.4481 16.7578 4.3490 8.0593 17.6381 11.4656 16.8809 1.0188 2.0755 1.7526 87.0128 6.7523 13.8791 102.9559 153.7747 68.7551 133.2962 40.9966 37.8635 0.5052 117.1479 50.6405 0.6446 68.8861 55.0959 95.0674 9.5967 14.8773 69.7056 64.9313 155.8339 19.5498 457.0043 21.3400 0.4645 43.8785 49.5989 6.0871 76.8272 228.2803 25.3700 5.2209 18.2352 7.1226 8.9603 0.5244 0.1035 3.1680 9.4371 32.5589 32.8393 26.2886 37.7795 27.0691 21.3869 3.6066 6.7413 150.1735
temp: 298.150 k
press: 1.00000 atm
elementType: 8 7 7 6 6 6 6 6 6 6 6 6 6 6 6 6 6 6 6 6 6 6 6 1 1 1 1 1 1 1 1 1 1 1 1 1 1 1 1 1 1
symmnumber: 1
zpe: 862333.0 jmol-1
zpe.correction: 0.328445 hartree
zpe.thermalcorrener: 0.347773 hartree
zpe.thermalcorrenthalpy: 0.348717 hartree
zpe.thermalcorrgfe: 0.277750 hartree
zpe.sumelectzpe: -956.070211 hartree
zpe.sumelectthermal: -956.050883 hartree
zpe.sumelectthermalent: -956.049939 hartree
zpe.sumelectthermalfe: -956.120906 hartree
dipole: -0.4251 4.6527 -0.9346
dipole: 4.7647
quadrupole: -122.3029 -132.9962 -127.4618
quadrupole: 5.5568 -0.8453 -1.3221
quadrupole: 5.2840 -5.4092 0.1252 5.5568 -0.8453 -1.3221
hfenergy: -956.3986564 hartree
pointgroup: C01 [X(C20H18N2O1)]
dipole: 1.04779 -1.5350508 -0.2444885 debye
polarizability: 274.5655237|54.257929|267.6098811|-2.9872221|4.1441084|165.0916729 unknown
InChI: InChI=1S/C20H18N2O/c23-20(21-18-12-6-2-7-13-18)22(19-14-8-3-9-15-19)16-17-10-4-1-5-11-17/h1-15,21H,16H2
charge 0 multiplicity 1
41 atoms
O  -0.99283 2.087854 0.103193
N  0.857266 0.780754 -0.551076
N  -1.263995 -0.224745 -0.24659
C  1.326001 -0.443096 -1.248072
C  1.403234 -1.695086 -0.365242
C  1.779706 1.872092 -0.341245
C  -0.512837 0.957679 -0.203097
C  1.022584 -2.956531 -0.887864
C  1.889093 -1.61714 0.96486
C  1.786315 2.57416 0.89216
C  2.703803 2.240385 -1.351749
C  -2.67445 -0.358949 -0.111568
C  1.135601 -4.1260 -0.099957
C  2.000285 -2.783177 1.752705
C  2.710132 3.617002 1.10781
C  3.636675 3.276025 -1.122574
C  1.625236 -4.041221 1.22295
C  3.647137 3.969754 0.107915
C  -3.194552 -1.683665 -0.108772
C  -3.56604 0.741881 0.001093
C  -4.581417 -1.906533 0.000756
C  -4.953143 0.500138 0.106295
C  -5.473963 -0.814092 0.107167
H  0.688623 -0.649061 -2.130699
H  2.339599 -0.230125 -1.627001
H  0.644863 -3.027081 -1.916337
H  2.173438 -0.642539 1.377391
H  1.056078 2.316246 1.663881
H  2.679937 1.746057 -2.32946
H  -0.747681 -1.108974 -0.279446
H  0.839821 -5.095482 -0.515902
H  2.376827 -2.712818 2.779201
H  2.700316 4.153161 2.063347
H  4.342862 3.5491 -1.914619
H  1.710545 -4.944287 1.837234
H  4.366239 4.77713 0.282787
H  -2.508127 -2.537165 -0.190234
H  -3.165113 1.756477 0.017634
H  -4.963682 -2.933557 0.002578
H  -5.632908 1.355686 0.19223
H  -6.552378 -0.985254 0.191615
