program: Gaussian 09
title: 000294964
version: EM64L-G09RevD.01
frameworkgroup: C1[X(C14H13FN2O2)]
method: RPBEPBE
basis: SDD
operation: Freq
keyword: #p
keyword: freq=noraman
keyword: PBEPBE/SDD
title: #p freq=noraman PBEPBE/SDD
converged: YES YES NO NO
title: Mulliken charges:
elementType: F O O N N C C C C C C C C C C C C C C H H H H H H H H H H H H H
charge: -0.228307 -0.330560 -0.290215 -0.491272 -0.495255 0.307388 0.174283 0.310749 -0.311916 0.263832 -0.322639 -0.234862 -0.252090 0.121551 -0.300016 -0.326423 -0.224617 -0.223047 -0.526991 0.335837 0.307045 0.319948 0.238910 0.226754 0.225296 0.313190 0.253001 0.229085 0.233749 0.227676 0.227841 0.242073
chargesum: 0.00000
title: Mulliken charges with hydrogens summed into heavy atoms:
elementType: F O O N N C C C C C C C C C C C C C C
charge: -0.228307 -0.330560 -0.290215 -0.155435 -0.175307 0.307388 0.174283 0.310749 -0.004871 0.263832 -0.083729 -0.008108 -0.026795 0.121551 0.013174 -0.073422 0.004468 0.010702 0.170600
polarizability: 3.03366964e+02 -2.88024706e+00 1.89514231e+02 -1.06178976e-01 -1.14530836e-01 7.26003071e+01
1716.lowfreq: -6.4300 -2.9915 -0.0012 -0.0010 -0.0007 7.3808 20.0577 35.2786 59.6305
frequency: 20.0507 35.2699 59.6207 80.2733 89.2956 98.7915 145.7734 179.5366 183.5486 194.6321 238.4935 256.0629 285.5332 293.4827 304.0629 320.2920 433.0769 436.6604 449.8790 477.8393 505.9484 532.5992 534.1295 554.9649 567.4700 583.8803 620.1546 694.7222 710.7105 716.4553 726.7595 735.1198 751.7684 757.0122 766.8812 781.7191 814.5792 852.0222 859.6795 883.5039 934.6844 937.8621 982.7049 987.1813 996.2444 1001.1175 1027.7346 1040.4812 1077.1772 1109.6769 1116.2372 1151.3264 1156.8554 1168.9908 1173.2670 1195.8292 1197.5564 1250.4590 1258.8589 1304.0673 1316.5955 1383.3698 1396.8694 1427.8580 1442.1418 1450.4252 1466.0314 1470.1351 1471.0748 1486.1358 1515.0283 1528.3188 1589.9142 1605.5661 1612.8734 1628.0585 1650.6344 2968.0212 3058.5290 3126.4244 3136.2744 3142.9059 3152.1580 3161.2586 3168.4918 3180.2005 3196.9983 3198.8370 3486.7941 3523.1664
redmass: 5.4380 5.7937 5.5681 4.2961 5.1274 4.5288 5.3929 3.1395 7.2642 3.5660 1.4476 4.1875 4.4319 8.2320 3.3700 6.8568 6.6001 3.0193 3.1930 6.8750 6.7974 6.9732 2.1771 3.6645 6.0000 1.8266 6.4978 2.4525 2.8280 2.7019 6.0300 3.4456 1.2669 1.2405 6.2779 6.4961 5.9955 1.3794 1.3462 6.0019 1.3466 1.3420 1.2951 1.2908 8.2851 7.3749 2.0119 2.0438 2.7781 1.9834 1.2573 1.4221 1.6505 1.1324 1.0728 2.4389 2.6280 1.7185 1.7993 1.7808 2.0878 5.2795 6.0410 1.5442 2.7474 1.7930 1.0499 1.4772 2.0902 1.5589 2.6000 2.6094 5.4180 5.6972 6.7577 7.3491 3.8667 1.0323 1.1044 1.1003 1.0857 1.0868 1.0913 1.0921 1.0983 1.0981 1.0950 1.0952 1.0763 1.0759
irintensity: 0.7918 1.0136 0.6697 0.1031 2.7366 11.5174 6.3288 4.5006 2.8173 0.1045 1.0758 5.6109 2.2153 0.2664 0.5152 4.2538 13.5742 4.6066 12.1504 7.5993 3.3627 11.5622 3.2762 1.3277 2.6386 4.0222 0.2766 22.1568 27.4372 50.8592 0.9334 25.3941 101.2525 181.2891 23.3213 4.6857 5.2788 1.4533 2.2796 0.5482 5.4846 10.0994 2.6034 4.2220 46.1184 23.3593 21.2705 22.3583 23.4289 55.4636 0.1629 11.8740 7.9988 1.5784 7.5996 270.4556 61.8803 32.6923 85.0917 155.0922 14.1694 102.5269 145.2370 100.2584 95.1637 95.6482 14.2069 120.6671 4.6079 13.6402 1450.5898 23.3644 7.3046 9.1574 120.4600 75.7424 86.0445 69.3736 42.8308 19.3226 0.5047 4.2699 20.9187 15.2519 22.3991 7.9832 8.2170 8.2448 61.3650 42.9362
temp: 298.150 k
press: 1.00000 atm
elementType: 9 8 8 7 7 6 6 6 6 6 6 6 6 6 6 6 6 6 6 1 1 1 1 1 1 1 1 1 1 1 1 1
symmnumber: 1
zpe: 643242.0 jmol-1
zpe.correction: 0.244998 hartree
zpe.thermalcorrener: 0.261872 hartree
zpe.thermalcorrenthalpy: 0.262816 hartree
zpe.thermalcorrgfe: 0.198870 hartree
zpe.sumelectzpe: -899.742673 hartree
zpe.sumelectthermal: -899.725799 hartree
zpe.sumelectthermalent: -899.724854 hartree
zpe.sumelectthermalfe: -899.788801 hartree
dipole: 1.9378 3.3296 0.0284
dipole: 3.8525
quadrupole: -82.4501 -101.8906 -116.5092
quadrupole: 11.2696 0.0252 0.0256
quadrupole: 17.8332 -1.6073 -16.2259 11.2696 0.0252 0.0256
hfenergy: -899.9876708 hartree
pointgroup: C01 [X(C14H13F1N2O2)]
dipole: -0.7033509 -1.3351131 0.1416592 debye
polarizability: 303.1857321|1.5581368|188.7227607|-7.1777713|-9.3768587|73.5730093 unknown
InChI: InChI=1S/C14H13FN2O2/c1-19-13-9-5-4-8-12(13)17-14(18)16-11-7-3-2-6-10(11)15/h2-9,16-17H,1H3
charge 0 multiplicity 1
32 atoms
F  3.285434 -2.254946 0.169198
O  -2.759167 -2.000289 0.351123
O  0.356323 1.798928 -0.059838
N  -0.888264 -0.195355 0.138404
N  1.432547 -0.296942 0.074095
C  -2.212008 0.308829 0.139857
C  -3.243876 -0.675008 0.255974
C  2.784143 0.10551 0.00434
C  -2.571987 1.672824 0.038752
C  0.298074 0.537893 0.042674
C  -4.60131 -0.306032 0.270562
C  -3.937797 2.040415 0.053642
C  -4.948555 1.063641 0.16833
C  3.766096 -0.917669 0.053557
C  3.249965 1.442879 -0.109633
C  5.141424 -0.685826 -0.002934
C  4.637852 1.700111 -0.168543
C  5.586873 0.653289 -0.116744
C  -3.740863 -3.077315 0.481411
H  -0.851963 -1.216673 0.221439
H  -1.780595 2.418934 -0.04879
H  1.298409 -1.307996 0.156241
H  -5.386279 -1.062828 0.359912
H  -4.205224 3.099302 -0.025484
H  -6.003941 1.355308 0.179233
H  2.516433 2.249464 -0.14921
H  5.836556 -1.529101 0.041175
H  4.978048 2.73732 -0.256367
H  6.658876 0.867514 -0.163483
H  -4.409527 -3.113366 -0.399661
H  -4.34223 -2.956385 1.402557
H  -3.152268 -4.00463 0.540308
