program: Gaussian 09
title: 000294958
version: EM64L-G09RevD.01
frameworkgroup: C1[X(C14H8Cl2F3NO)]
method: RPBEPBE
basis: SDD
operation: Freq
keyword: #p
keyword: freq=noraman
keyword: PBEPBE/SDD
title: #p freq=noraman PBEPBE/SDD
converged: YES YES NO NO
title: Mulliken charges:
elementType: Cl Cl F F F O N C C C C C C C C C C C C C C H H H H H H H H
charge: -0.002569 -0.027025 -0.146120 -0.184174 -0.169288 -0.212050 -0.479602 0.410023 0.093280 -0.320094 0.375356 -0.334043 0.138727 0.239854 -0.215813 -0.238499 -0.303274 -0.354423 -0.208772 -0.224332 -0.091122 0.360287 0.315971 0.265619 0.240213 0.242832 0.274581 0.286390 0.268068
chargesum: 0.00000
title: Mulliken charges with hydrogens summed into heavy atoms:
elementType: Cl Cl F F F O N C C C C C C C C C C C C C C
charge: -0.002569 -0.027025 -0.146120 -0.184174 -0.169288 -0.212050 -0.119315 0.410023 0.093280 -0.004123 0.375356 -0.068424 0.138727 0.239854 0.024399 0.004334 -0.303274 -0.079842 0.077618 0.043736 -0.091122
polarizability: 2.87451094e+02 2.66977723e+01 1.94794542e+02 -7.64307332e+00 6.07587042e+00 9.07891102e+01
1716.lowfreq: -5.6973 -4.8180 -2.3537 0.0012 0.0018 0.0021 17.9424 27.0414 39.6326
frequency: 17.8533 26.9708 39.6301 51.3963 77.7457 97.9799 125.2328 139.0444 158.5264 162.8082 201.6452 210.7042 228.8324 276.2757 289.7691 321.1986 334.2171 360.1126 380.8149 403.7769 421.0154 427.2789 445.5871 498.6322 513.0580 529.1218 562.1382 564.4054 593.1171 605.7823 655.8289 673.4853 690.9378 701.5165 743.0762 750.5014 760.0055 775.1756 820.6129 843.5354 867.7713 871.9569 895.4656 937.0741 961.5126 970.6584 976.4247 1005.6367 1019.1404 1028.1260 1054.6570 1086.4284 1095.5937 1135.8848 1147.0506 1183.4142 1234.3156 1247.7193 1260.2914 1278.8863 1308.5231 1349.5745 1376.6650 1377.4686 1442.2441 1454.3274 1472.6088 1520.2050 1559.7761 1586.0988 1590.4855 1618.0854 1629.0540 3140.6282 3145.6400 3162.6079 3180.5931 3181.0309 3185.0998 3199.9811 3506.5513
redmass: 10.6951 9.0498 11.0764 15.9334 8.9638 5.2190 6.8454 13.3745 11.5474 6.1049 10.6360 8.3369 7.0692 8.9099 14.3933 10.2975 5.5530 7.0065 12.0742 9.5815 4.7773 6.3969 4.6009 7.7143 4.3721 8.3819 5.5381 4.4615 6.2095 9.7174 6.2562 2.0453 3.1294 3.4912 5.0251 4.4013 8.1964 1.2864 2.1496 2.6078 5.7914 1.4275 1.4474 5.8543 1.4268 1.6272 4.4137 1.3258 5.7466 5.4446 2.2653 2.3494 5.1344 1.8343 1.3974 1.0653 2.9970 1.9991 1.5024 2.6597 1.9176 3.9699 5.8247 8.3962 2.5372 2.5191 2.5125 2.1974 7.9297 7.1299 6.4179 6.9221 3.6684 1.0906 1.0876 1.0916 1.0982 1.0955 1.0939 1.0955 1.0771
irintensity: 1.2443 0.5033 0.3524 0.4764 5.3660 0.2564 0.7087 2.5977 3.6880 0.1615 1.2811 0.1474 1.6773 1.8240 1.1617 7.7087 2.1637 0.1712 8.0012 3.1229 4.2664 1.7206 9.3725 18.0392 9.0528 0.8567 14.3445 1.9713 13.8034 8.0398 0.4243 12.6895 17.2868 15.5070 2.7043 6.1538 23.6742 132.5039 29.8007 27.3206 46.9724 16.9920 6.1115 213.1297 14.1830 22.6446 101.4628 1.5289 13.2782 183.5120 2.5469 97.0029 36.4861 15.7383 6.0030 6.8930 102.7103 140.8421 42.0755 197.0328 186.9230 9.5312 11.9217 98.5532 132.1604 37.3296 48.9673 387.2327 26.5054 170.8090 130.3601 81.6029 57.7036 2.1612 4.7841 7.2779 8.9791 0.2827 0.9118 11.8576 49.1003
temp: 298.150 k
press: 1.00000 atm
elementType: 17 17 9 9 9 8 7 6 6 6 6 6 6 6 6 6 6 6 6 6 6 1 1 1 1 1 1 1 1
symmnumber: 1
zpe: 494803.0 jmol-1
zpe.correction: 0.188461 hartree
zpe.thermalcorrener: 0.207026 hartree
zpe.thermalcorrenthalpy: 0.207970 hartree
zpe.thermalcorrgfe: 0.138874 hartree
zpe.sumelectzpe: -1886.455402 hartree
zpe.sumelectthermal: -1886.436837 hartree
zpe.sumelectthermalent: -1886.435893 hartree
zpe.sumelectthermalfe: -1886.504988 hartree
dipole: 2.2793 -0.5252 -0.0234
dipole: 2.3392
quadrupole: -116.8053 -139.6587 -137.3668
quadrupole: 9.2155 -2.5663 4.2297
quadrupole: 14.4716 -8.3818 -6.0899 9.2155 -2.5663 4.2297
hfenergy: -1886.6438628 hartree
pointgroup: C01 [X(C14H8Cl2F3N1O1)]
dipole: 0.8963747 -0.1988585 -0.0625935 debye
polarizability: 286.8328918|28.5220247|191.2555405|-9.0420317|19.682412|94.9463142 unknown
InChI: InChI=1S/C14H8Cl2F3NO/c15-8-5-6-9(11(16)7-8)13(21)20-12-4-2-1-3-10(12)14(17,18)19/h1-7,20H
charge 0 multiplicity 1
29 atoms
Cl -2.937377 2.589579 1.481166
Cl -6.067441 -1.624424 -0.217223
F  3.382572 -2.780271 0.234261
F  1.431988 -2.089123 1.170265
F  1.605565 -2.26989 -1.07706
O  -0.497528 2.430879 -0.527432
N  0.473763 0.359158 0.045697
C  1.857915 0.646183 -0.065198
C  2.803702 -0.429879 -0.0028
C  2.344192 1.970834 -0.228017
C  -1.9417 0.503627 -0.137478
C  4.191052 -0.167737 -0.075746
C  -0.609211 1.212488 -0.218106
C  2.344726 -1.85228 0.077717
C  3.73041 2.210597 -0.309375
C  4.661831 1.150899 -0.22568
C  -3.067646 1.053806 0.52504
C  -2.117337 -0.728276 -0.826102
C  -4.323147 0.414667 0.513561
C  -3.362921 -1.38788 -0.862101
C  -4.450207 -0.799538 -0.188297
H  0.224152 -0.571005 0.393938
H  1.625719 2.789005 -0.291157
H  4.894466 -1.003283 -0.021331
H  4.08284 3.24016 -0.432737
H  5.736746 1.345966 -0.281389
H  -1.271549 -1.162993 -1.37054
H  -5.172994 0.851537 1.042944
H  -3.483682 -2.328605 -1.405011
