program: Gaussian 09
title: 000294966
version: EM64L-G09RevD.01
frameworkgroup: C1[X(C14H17F3N2O)]
method: RPBEPBE
basis: SDD
operation: Freq
keyword: #p
keyword: freq=noraman
keyword: PBEPBE/SDD
title: #p freq=noraman PBEPBE/SDD
converged: YES YES NO NO
title: Mulliken charges:
elementType: F F F O N N C C C C C C C C C C C C C C H H H H H H H H H H H H H H H H H
charge: -0.165549 -0.173670 -0.167967 -0.294192 -0.448979 -0.506378 -0.027558 -0.417991 -0.450657 -0.404713 -0.408905 -0.377895 0.283073 0.514480 -0.591276 -0.345437 0.347003 -0.196349 -0.375089 0.252128 0.257960 0.241651 0.196595 0.205001 0.217941 0.196222 0.208680 0.213538 0.173599 0.196855 0.204556 0.285162 0.293737 0.249980 0.318042 0.261456 0.234946
chargesum: 0.00000
title: Mulliken charges with hydrogens summed into heavy atoms:
elementType: F F F O N N C C C C C C C C C C C C C C
charge: -0.165549 -0.173670 -0.167967 -0.294192 -0.163817 -0.212641 0.230402 0.020255 -0.027716 0.000189 -0.021767 0.023516 0.283073 0.514480 -0.341296 -0.027395 0.347003 0.038597 -0.113633 0.252128
polarizability: 2.49462997e+02 -1.00500529e+01 1.64334783e+02 -6.65266510e+00 5.42441182e+00 1.09411406e+02
1716.lowfreq: -16.3588 -5.1717 -0.0008 -0.0004 -0.0003 1.7976 5.5326 17.8923 28.0299
frequency: -9.6867 17.7184 28.0297 51.2120 53.6866 78.5204 111.7686 128.9090 156.8299 198.4555 212.9908 224.7677 252.8474 274.8865 304.8221 329.5242 342.1011 347.4180 386.5304 395.8734 406.3406 428.0284 464.4425 479.1554 489.1684 521.4834 575.7335 590.7430 609.5785 628.8719 632.2638 688.8684 697.4747 707.3600 763.7974 774.2627 798.4104 809.3816 830.2852 855.8982 860.5869 882.3278 886.7816 922.1916 928.4686 964.3705 981.5771 982.4197 1002.6867 1007.8702 1011.6084 1026.9022 1046.1454 1053.2689 1076.1020 1087.6193 1104.0522 1114.2446 1148.8938 1155.7469 1187.0063 1202.2947 1238.7805 1243.2222 1258.1339 1271.9509 1298.7169 1306.7763 1320.9349 1325.0487 1331.2568 1333.6552 1349.0725 1354.0082 1366.0629 1382.5875 1421.0203 1454.2604 1461.6927 1463.8944 1467.1705 1473.0059 1486.9301 1488.5975 1520.2171 1599.0681 1624.1577 1645.7127 2944.5980 2968.2271 2969.9098 2979.4684 2984.6994 3027.6372 3031.2681 3035.2336 3039.9154 3045.8306 3055.6752 3136.5773 3148.0769 3174.4098 3194.7056 3525.6573 3544.0360
redmass: 4.1775 12.6021 4.2220 5.1101 5.6658 4.9598 4.4566 6.7815 6.3549 2.5625 3.2578 2.8629 4.3545 5.9786 6.3996 2.1776 2.2834 2.9205 2.3526 7.0846 2.5850 5.0863 2.2485 2.8197 4.0110 10.3267 1.2941 5.5620 7.9658 4.6913 2.8219 8.0274 2.1520 10.2824 5.0330 1.5505 3.4945 1.3991 2.1046 2.3172 2.5218 2.9168 1.6396 1.4031 1.3761 2.8536 10.1296 6.1857 1.3365 3.2237 4.9430 3.3716 1.4888 1.9121 2.5197 1.7261 1.6858 1.0464 2.2528 1.8128 1.0965 1.7303 1.6781 1.4684 1.2743 1.3178 1.6679 1.9145 2.3793 1.4718 1.3748 1.4227 1.4453 1.4532 1.4026 3.2879 3.7679 1.1224 1.1172 1.5460 1.0859 1.0911 1.8135 1.5860 2.2124 6.2109 5.8498 4.4392 1.0685 1.0666 1.0603 1.0633 1.0621 1.0913 1.0945 1.0906 1.0987 1.1017 1.1000 1.0917 1.0884 1.0957 1.0956 1.0764 1.0768
irintensity: 0.0520 0.0830 0.4812 3.8354 6.9514 5.2666 4.5067 0.4589 0.5692 0.8211 1.0646 0.6190 12.9898 1.2583 0.6499 3.0074 4.7891 14.2143 5.7275 5.7682 2.7226 1.0864 2.1246 1.8755 19.9486 0.1742 127.9538 17.6218 7.8326 4.7167 2.0786 1.3100 31.6826 12.7030 0.6871 1.1423 1.4393 62.6386 3.4214 24.2063 7.4423 17.8725 65.3523 13.5835 0.7097 36.1616 209.6027 29.4718 6.6217 37.1445 124.7097 82.3577 12.9639 21.7199 30.6552 1.6948 0.5614 1.3455 6.5021 8.2344 3.5368 256.4961 85.5554 90.7109 18.7318 60.6678 56.2673 43.6840 201.6932 28.9139 5.8469 0.9024 2.7929 1.2739 0.1441 62.8500 14.5726 64.6527 29.6608 410.4599 9.0694 48.2646 37.9353 275.7599 412.4363 18.1235 47.4085 199.4823 38.7894 26.2394 40.4669 20.8417 30.7096 70.1822 76.4312 8.2747 38.7096 61.9853 61.8062 6.7601 8.8181 3.3778 11.0322 4.6113 35.3968
temp: 298.150 k
press: 1.00000 atm
elementType: 9 9 9 8 7 7 6 6 6 6 6 6 6 6 6 6 6 6 6 6 1 1 1 1 1 1 1 1 1 1 1 1 1 1 1 1 1
symmnumber: 1
zpe: 769040.1 jmol-1
zpe.correction: 0.292912 hartree
zpe.thermalcorrener: 0.310812 hartree
zpe.thermalcorrenthalpy: 0.311756 hartree
zpe.thermalcorrgfe: 0.245023 hartree
zpe.sumelectzpe: -1026.486170 hartree
zpe.sumelectthermal: -1026.468270 hartree
zpe.sumelectthermalent: -1026.467326 hartree
zpe.sumelectthermalfe: -1026.534059 hartree
dipole: 5.4978 -1.6220 -0.5305
dipole: 5.7566
quadrupole: -122.6652 -117.4315 -120.8261
quadrupole: -16.8525 -1.2821 2.5504
quadrupole: -2.3576 2.8761 -0.5185 -16.8525 -1.2821 2.5504
hfenergy: -1026.7790815 hartree
pointgroup: C01 [X(C14H17F3N2O1)]
dipole: -2.1645709 -0.6175578 0.2503526 debye
polarizability: 249.4914997|9.3279701|163.4740845|-7.60902|-8.5053534|110.2436013 unknown
InChI: InChI=1S/C14H17F3N2O/c15-14(16,17)10-5-4-8-12(9-10)19-13(20)18-11-6-2-1-3-7-11/h4-5,8-9,11,18-19H,1-3,6-7H2
charge 0 multiplicity 1
37 atoms
F  5.829349 -0.552349 0.535036
F  4.292457 -2.216308 0.715047
F  4.970403 -1.508905 -1.326129
O  -1.452957 1.991584 0.085803
N  -2.518652 -0.044694 0.485228
N  -0.183654 0.001214 0.2850
C  -3.874788 0.554343 0.504991
C  -4.456542 0.709704 -0.927429
C  -4.812162 -0.303875 1.389761
C  -4.79167 -0.65442 -1.574834
C  -5.157945 -1.66969 0.743004
C  -5.741726 -1.48688 -0.679226
C  -1.392352 0.737766 0.268754
C  1.130242 0.491265 0.089648
C  2.190364 -0.45171 0.146494
C  1.429658 1.861126 -0.154393
C  3.523279 -0.030149 -0.031998
C  2.771411 2.258136 -0.329906
C  3.831618 1.329157 -0.273558
C  4.624533 -1.048617 -0.019135
H  -3.756231 1.560643 0.946224
H  -3.739794 1.279774 -1.545892
H  -5.379975 1.3202 -0.856186
H  -5.751375 0.265156 1.534596
H  -4.360936 -0.443237 2.390948
H  -3.853975 -1.222616 -1.746947
H  -5.247395 -0.49526 -2.570546
H  -5.874074 -2.214016 1.387609
H  -4.253006 -2.313792 0.685377
H  -6.718795 -0.966145 -0.603811
H  -5.940276 -2.473488 -1.140439
H  -2.445064 -1.058825 0.578527
H  -0.249522 -1.001539 0.471992
H  1.980793 -1.510325 0.339549
H  0.611476 2.582083 -0.194465
H  4.869712 1.648418 -0.401646
H  2.991073 3.315271 -0.511848
