program: Gaussian 09
title: 000294907
version: EM64L-G09RevD.01
frameworkgroup: C1[X(C8H15NO5)]
method: RPBEPBE
basis: SDD
operation: Freq
keyword: #p
keyword: freq=noraman
keyword: PBEPBE/SDD
title: #p freq=noraman PBEPBE/SDD
converged: YES YES NO NO
title: Mulliken charges:
elementType: O O O O O N C C C C C C C C H H H H H H H H H H H H H H H
charge: -0.322988 -0.425746 -0.303922 -0.404502 -0.235992 -0.441781 0.335231 -0.709556 -0.700926 -0.711058 -0.172140 0.320454 -0.343435 0.183004 0.220731 0.211077 0.268675 0.228016 0.229322 0.205184 0.268053 0.212259 0.219111 0.279469 0.360638 0.245684 0.245242 0.347763 0.392133
chargesum: 0.00000
title: Mulliken charges with hydrogens summed into heavy atoms:
elementType: O O O O O N C C C C C C C C
charge: -0.322988 -0.077983 -0.303922 -0.012368 -0.235992 -0.081143 0.335231 -0.009073 -0.038404 -0.011635 0.107329 0.320454 0.147491 0.183004
polarizability: 1.41960077e+02 4.07318758e-01 9.79413971e+01 -4.15055101e+00 8.36113288e+00 9.45468009e+01
1716.lowfreq: -11.8776 -3.2139 -0.0005 0.0005 0.0007 7.0589 36.9793 45.9889 69.9520
frequency: 36.6486 45.9558 69.9484 81.6798 84.0889 97.4980 123.3097 178.0229 184.4869 207.4291 230.4089 233.8322 251.3031 277.9665 303.1037 319.6706 331.4146 390.5418 401.3027 427.4968 433.1396 477.5770 543.9527 557.0542 622.7936 656.2752 701.0651 708.2286 715.4815 760.4208 811.7118 847.7911 879.6573 916.1128 920.1329 954.1725 979.2127 1003.3695 1027.6344 1029.0681 1033.4175 1070.5635 1143.6335 1163.5102 1190.0537 1213.6852 1230.7724 1257.7325 1272.0709 1280.0527 1333.6156 1353.3134 1372.5848 1376.5692 1378.7707 1398.4632 1445.1947 1465.0817 1467.2088 1468.2159 1469.5333 1470.5090 1479.3490 1502.4536 1628.1698 1659.6148 2988.5335 2990.2166 2995.4893 3000.6210 3011.0066 3080.4883 3083.7221 3097.1864 3099.5782 3111.7415 3116.2269 3116.3548 3517.6098 3527.7791 3544.4505
redmass: 3.7657 4.8302 7.3378 5.9729 4.7775 6.2173 4.1685 1.3453 2.5743 3.4970 2.4641 1.2617 1.0657 3.5084 3.0672 3.5581 2.5918 1.3683 2.5886 2.7939 2.8595 2.9998 2.5005 4.2847 1.5654 1.3254 6.1789 4.2920 7.6213 4.7903 3.7354 3.4605 2.8147 1.5941 1.6031 1.2032 3.6213 4.6565 1.6896 1.4221 1.5542 2.7678 2.2205 1.8927 1.5467 1.5727 1.7639 3.0216 2.8160 1.5557 1.3299 1.7628 1.2311 1.2430 1.3652 1.2183 1.0467 1.3269 1.1049 1.0822 1.1399 1.2938 1.0522 1.0608 9.0430 8.8013 1.0360 1.0358 1.0363 1.0743 1.0739 1.0993 1.0991 1.0993 1.1005 1.1002 1.0998 1.0997 1.0774 1.0643 1.0655
irintensity: 0.1696 1.1442 1.5297 8.3252 0.8538 0.9163 0.9368 3.3831 7.0540 5.3235 7.1135 2.0733 0.0622 9.8076 17.9850 12.6793 0.2173 150.7411 7.3711 18.6871 2.9485 10.8966 37.1788 45.7130 78.1156 93.8342 2.3837 53.8052 24.3502 4.8565 10.6457 14.0824 23.1069 0.8600 3.0919 0.2605 297.1654 129.3874 14.1227 0.1401 20.3468 95.2865 167.4734 287.2147 8.1827 14.7044 54.7664 27.6776 21.0585 5.9700 41.7716 146.1133 45.1572 50.7347 71.5158 29.5219 0.7509 171.3039 34.2967 9.3292 54.1108 125.0302 4.0765 45.1827 274.9823 147.2532 24.6898 10.0498 28.2812 22.5901 20.9365 10.6480 18.6346 54.5001 29.2501 6.4375 24.6918 4.6305 95.9996 36.1318 3.6479
temp: 298.150 k
press: 1.00000 atm
elementType: 8 8 8 8 8 7 6 6 6 6 6 6 6 6 1 1 1 1 1 1 1 1 1 1 1 1 1 1 1
symmnumber: 1
zpe: 611447.9 jmol-1
zpe.correction: 0.232888 hartree
zpe.thermalcorrener: 0.249351 hartree
zpe.thermalcorrenthalpy: 0.250295 hartree
zpe.thermalcorrgfe: 0.188587 hartree
zpe.sumelectzpe: -743.619181 hartree
zpe.sumelectthermal: -743.602718 hartree
zpe.sumelectthermalent: -743.601774 hartree
zpe.sumelectthermalfe: -743.663482 hartree
dipole: 1.2837 -1.1615 0.4236
dipole: 1.7822
quadrupole: -69.2770 -88.7957 -87.1783
quadrupole: 4.3648 -8.0191 -2.8620
quadrupole: 12.4733 -7.0453 -5.4280 4.3648 -8.0191 -2.8620
hfenergy: -743.8520688 hartree
pointgroup: C01 [X(C8H15N1O5)]
dipole: -0.5192158 -0.3345391 0.3319124 debye
polarizability: 141.9554231|-4.4187467|88.9584781|0.091789|4.2127355|103.5343734 unknown
InChI: InChI=1S/C8H15NO5/c1-8(2,3)14-7(13)9-5(4-10)6(11)12/h5,9-11H,4H2,1-3H3
charge 0 multiplicity 1
29 atoms
O  -1.554851 0.266747 0.575675
O  2.6444 1.986659 -0.852348
O  -0.600544 -0.651577 -1.400835
O  4.204277 -0.894148 0.433311
O  2.819566 -0.026239 2.087215
N  0.696019 0.11443 0.387606
C  -3.001498 0.122238 0.109801
C  -3.315924 -1.369447 -0.118316
C  -3.776156 0.688086 1.311976
C  -3.215428 0.974685 -1.156883
C  1.960015 -0.324017 -0.210152
C  -0.506736 -0.139864 -0.250346
C  2.422792 0.631508 -1.350922
C  3.000013 -0.385213 0.902805
H  -3.091964 -1.95424 0.791568
H  -4.391067 -1.487231 -0.346719
H  -2.729442 -1.771723 -0.959117
H  -3.494211 1.738897 1.496969
H  -3.561218 0.103278 2.222802
H  -4.861742 0.644372 1.112821
H  -2.632616 0.578044 -2.003153
H  -4.286709 0.96478 -1.429166
H  -2.918078 2.022352 -0.971956
H  1.851382 -1.333611 -0.65402
H  0.702443 0.404367 1.37042
H  1.656083 0.600179 -2.148983
H  3.392952 0.296626 -1.747168
H  1.789614 2.320669 -0.475822
H  4.88173 -0.88861 1.161934
