program: Gaussian 09
title: 000294913
version: EM64L-G09RevD.01
frameworkgroup: C1[X(C14H19N3O4)]
method: RPBEPBE
basis: SDD
operation: Freq
keyword: #p
keyword: freq=noraman
keyword: PBEPBE/SDD
title: #p freq=noraman PBEPBE/SDD
converged: YES YES NO NO
title: Mulliken charges:
elementType: O O O O N N N C C C C C C C C C C C C C C H H H H H H H H H H H H H H H H H H H
charge: -0.285973 -0.298231 -0.320330 -0.296358 -0.360508 -0.390030 -0.611970 -0.167333 0.193069 -0.374282 -0.684142 -0.507017 0.304499 -0.475413 0.469098 0.273760 -0.389611 -0.370080 -0.226812 -0.229407 -0.235107 0.261192 0.261465 0.233302 0.363592 0.222880 0.212537 0.268351 0.365971 0.264459 0.223759 0.240442 0.217092 0.232360 0.273975 0.224617 0.225177 0.226597 0.341602 0.322811
chargesum: 0.00000
title: Mulliken charges with hydrogens summed into heavy atoms:
elementType: O O O O N N N C C C C C C C C C C C C C C
charge: -0.285973 -0.298231 -0.320330 -0.296358 0.003084 -0.024059 0.052443 0.093859 0.193069 0.120484 0.019627 -0.018800 0.304499 -0.017880 0.469098 0.273760 -0.157251 -0.096105 -0.002195 -0.004230 -0.008510
polarizability: 2.34716812e+02 1.89912613e+00 1.68018472e+02 -1.53368604e+01 -1.12228052e+01 1.46926170e+02
1716.lowfreq: -12.9887 -6.2427 -3.9295 -0.0002 0.0004 0.0005 7.9886 20.3425 22.6899
frequency: -0.9753 20.1981 22.6559 29.9488 36.0620 50.3560 65.4510 86.4482 89.2737 104.1630 112.6615 156.7763 183.1328 225.0725 233.9066 243.5857 263.7339 289.5805 300.7913 317.0980 350.8111 404.3563 405.4226 412.7724 460.7671 483.1670 492.3142 538.6551 557.2789 593.8312 608.7198 612.7851 617.7880 662.5283 674.6362 688.8660 701.0048 706.0609 722.1923 744.7270 757.9119 776.9435 815.2763 827.4491 858.6992 875.6595 885.6878 922.3064 934.9791 969.3146 981.4930 988.9904 994.8818 999.2658 1001.0046 1027.2709 1040.9796 1055.0484 1058.0252 1089.9011 1090.7650 1098.8304 1168.4088 1172.1400 1188.3273 1193.3310 1202.9037 1214.7945 1221.3194 1241.0103 1252.0917 1288.4777 1299.6951 1330.1867 1331.5732 1351.5146 1355.7331 1384.6553 1385.3561 1389.1009 1432.3213 1441.7411 1453.4276 1461.4429 1466.2241 1472.8800 1483.2627 1484.4361 1501.8177 1590.7260 1594.3953 1610.7163 1614.5751 1637.5958 1650.5367 2986.9734 2989.0185 2989.9744 3002.5193 3031.5480 3050.7461 3085.7268 3089.4504 3104.3958 3106.4808 3118.2412 3125.9307 3138.7506 3150.1095 3163.1889 3466.4171 3474.8779 3515.9969 3670.8310
redmass: 4.8359 4.3293 5.1857 4.4065 5.6492 5.0493 6.9138 4.1061 4.9230 5.9620 4.4678 5.5289 5.3002 1.9994 5.3253 1.6630 3.3239 3.3361 4.0523 5.5315 2.5338 2.9138 3.1180 3.5191 1.8872 3.8893 2.1437 1.2688 4.1604 4.9323 1.9884 3.1405 5.7074 4.9460 2.1878 1.3341 4.5414 2.2799 2.4618 1.2017 2.1443 2.5854 3.4631 2.8792 1.2520 3.1731 3.6436 2.4969 1.5303 1.9510 1.4400 4.4541 2.8761 1.3505 2.4102 2.2164 2.0323 1.7682 2.0283 1.5321 2.5501 3.7140 2.5195 1.0570 1.1229 1.1939 1.6396 1.5701 2.8857 1.1603 1.6223 1.7752 1.4225 1.2572 1.2540 1.2814 1.5136 2.2170 7.8384 1.2757 1.0969 2.1747 1.4080 1.1220 1.3153 1.2746 1.1584 2.0911 1.8641 1.7034 6.1072 7.2387 6.0628 2.4413 9.4170 1.0835 1.0600 1.0355 1.0654 1.0585 1.0995 1.0995 1.0999 1.1071 1.1013 1.0858 1.0876 1.0923 1.0962 1.1015 1.0785 1.0775 1.0451 1.1043
irintensity: 1.9609 0.0651 0.7116 1.2703 5.4304 1.4147 4.3561 5.3612 3.2466 12.4205 9.0818 2.7313 4.5143 5.4725 8.8318 8.1012 11.1443 3.8606 5.6511 12.4240 21.6038 0.5581 1.9826 9.2522 4.1340 6.8618 15.7069 155.1427 5.4564 23.4680 74.3840 7.9614 0.8391 11.6299 36.5686 99.8305 23.2169 72.3591 41.3536 122.5754 49.6149 16.1526 8.9356 3.5870 0.4799 57.7811 1.3223 0.6902 10.7659 39.9459 7.4344 40.1983 145.5794 2.7736 193.1115 3.5278 8.6943 5.8060 4.5811 8.2108 5.4744 47.9107 55.5071 0.6209 2.4176 24.8128 5.9303 84.1226 25.6325 14.7433 52.6164 145.7807 11.0473 2.0003 26.1993 11.2271 34.4864 128.8078 1.4799 11.2698 29.8535 10.3019 323.7851 22.4050 424.1234 205.5289 45.0261 27.8131 150.8082 61.7362 2.5046 166.4449 1.6450 298.1127 244.5603 25.1500 16.2708 22.4789 33.4253 40.4333 34.4510 3.3677 34.0666 7.1940 11.3009 4.2935 2.9709 23.8693 25.0425 24.1066 173.7737 152.4061 42.6911 29.7537
temp: 298.150 k
press: 1.00000 atm
elementType: 8 8 8 8 7 7 7 6 6 6 6 6 6 6 6 6 6 6 6 6 6 1 1 1 1 1 1 1 1 1 1 1 1 1 1 1 1 1 1 1
symmnumber: 1
zpe: 846047.9 jmol-1
zpe.correction: 0.322243 hartree
zpe.thermalcorrener: 0.342781 hartree
zpe.thermalcorrenthalpy: 0.343725 hartree
zpe.thermalcorrgfe: 0.269456 hartree
zpe.sumelectzpe: -1008.519024 hartree
zpe.sumelectthermal: -1008.498486 hartree
zpe.sumelectthermalent: -1008.497541 hartree
zpe.sumelectthermalfe: -1008.571811 hartree
dipole: 6.7741 2.1990 2.8404
dipole: 7.6676
quadrupole: -62.3171 -119.6720 -127.8482
quadrupole: 10.8605 10.1729 6.7765
quadrupole: 40.9620 -16.3929 -24.5691 10.8605 10.1729 6.7765
hfenergy: -1008.8412668 hartree
pointgroup: C01 [X(C14H19N3O4)]
dipole: 2.6533642 -0.7605407 1.2171531 debye
polarizability: 234.4448087|15.8006279|156.0062839|-1.8609171|15.5326922|159.2103622 unknown
InChI: InChI=1S/C14H19N3O4/c1-10(13(19)16-8-7-12(15)18)17-14(20)21-9-11-5-3-2-4-6-11/h2-6,10,16-17H,7-9,15H2,1H3
charge 0 multiplicity 1
40 atoms
O  -2.241144 -0.269261 -1.619384
O  2.093315 -1.5983 -1.402846
O  -1.439141 1.752917 -0.685187
O  5.479963 1.418423 0.826273
N  3.583962 0.048655 -0.696241
N  -0.063138 -0.121175 -0.990128
N  7.165174 0.1954 1.83325
C  1.167359 0.500902 -0.497349
C  2.322527 -0.444492 -0.910964
C  4.799443 -0.729646 -0.966961
C  1.137377 0.729139 1.038512
C  5.611906 -0.996212 0.32202
C  -1.246623 0.558866 -1.055374
C  -3.610058 0.336197 -1.692436
C  -4.422618 0.045057 -0.447656
C  6.070991 0.3042 0.999162
C  -5.277924 -1.084534 -0.395616
C  -4.339351 0.901324 0.681475
C  -6.036142 -1.360116 0.76444
C  -5.096467 0.626851 1.841796
C  -5.94705 -0.503325 1.886166
H  1.303419 1.484222 -0.99098
H  4.482089 -1.683662 -1.420632
H  5.429105 -0.18722 -1.697347
H  3.746281 0.957832 -0.246459
H  1.044191 -0.233919 1.57007
H  2.052035 1.242335 1.387271
H  0.269548 1.361789 1.287931
H  0.027149 -1.076791 -1.356295
H  4.97993 -1.557269 1.038085
H  6.484278 -1.634954 0.084887
H  -3.492382 1.421888 -1.853979
H  -4.04579 -0.142178 -2.584121
H  -5.34575 -1.750669 -1.26473
H  -3.668171 1.766627 0.641038
H  -6.694758 -2.235542 0.793678
H  -5.026563 1.293581 2.708776
H  -6.536513 -0.713443 2.786059
H  7.480402 1.025686 2.335872
H  7.655338 -0.686277 1.973423
