program: Gaussian 09
title: 000294947
version: EM64L-G09RevD.01
frameworkgroup: C1[X(C20H23N3O4S)]
method: RPBEPBE
basis: SDD
operation: Freq
keyword: #p
keyword: freq=noraman
keyword: PBEPBE/SDD
title: #p freq=noraman PBEPBE/SDD
converged: YES YES NO NO
title: Mulliken charges:
elementType: S O O O O N N N C C C C C C C C C C C C C C C C C C C C H H H H H H H H H H H H H H H H H H H H H H H
charge: 0.177135 -0.278708 -0.309520 -0.316328 -0.288063 -0.381894 -0.340468 -0.590270 -0.195029 -0.669331 0.254045 -0.828390 0.483336 0.310116 -0.487789 -0.477515 -0.353987 -0.443775 0.468299 -0.224096 -0.234304 0.243266 -0.238456 -0.369561 -0.382605 -0.226766 -0.225539 -0.232379 0.279217 0.321028 0.231826 0.370252 0.265994 0.273403 0.316064 0.250967 0.262595 0.241315 0.221022 0.244092 0.295644 0.226199 0.233237 0.228649 0.268967 0.233237 0.226446 0.226680 0.228722 0.342149 0.370873
chargesum: 0.00000
title: Mulliken charges with hydrogens summed into heavy atoms:
elementType: S O O O O N N N C C C C C C C C C C C C C C C C C C C C
charge: 0.177135 -0.278708 -0.309520 -0.316328 -0.288063 -0.011642 -0.024404 0.122752 0.084188 -0.116477 0.254045 -0.288993 0.483336 0.310116 0.025773 -0.015178 -0.109895 -0.148131 0.468299 0.002103 -0.001067 0.243266 -0.009807 -0.100594 -0.149368 -0.000320 0.001141 -0.003657
polarizability: 2.93999619e+02 -5.04072616e-01 2.77587404e+02 -2.97996527e+00 1.33775124e+01 2.11411436e+02
1716.lowfreq: -9.9229 -7.1037 -3.4299 -0.0005 0.0010 0.0017 9.0961 10.8546 15.3787
frequency: 6.6439 10.0631 14.7913 23.1342 28.1125 32.6505 37.0015 54.3298 64.3506 67.0009 78.6700 84.4999 88.7135 117.3983 140.4511 142.9055 155.1241 172.1171 197.4574 238.5237 239.7687 257.7776 283.4829 305.6788 319.2371 321.0809 341.9455 381.1573 403.4850 406.6349 422.5469 460.7022 473.4840 488.3153 511.5986 544.8501 553.3129 557.6819 588.2330 599.1149 614.3874 617.4068 621.5404 631.4692 650.6495 657.4417 668.4533 701.3805 705.1610 709.6942 721.7478 736.3180 757.9567 764.3308 773.0918 804.9767 815.8797 836.7393 854.0234 856.0094 860.4049 864.0651 888.9068 912.8732 933.7016 940.4585 943.5204 970.8970 980.4399 987.0922 988.4124 988.8128 990.9239 999.2586 1009.4024 1013.1145 1027.3204 1027.5316 1043.5667 1074.1521 1090.4771 1112.2029 1118.5082 1129.0120 1172.7144 1173.0416 1173.9498 1188.3659 1194.8503 1208.3094 1213.0563 1220.1280 1221.2578 1225.4146 1239.3199 1239.8078 1250.7926 1305.1676 1322.6768 1329.7604 1331.3072 1335.2811 1352.2738 1362.2602 1383.1534 1385.8817 1438.8986 1442.0773 1442.4909 1447.0683 1455.5813 1460.4137 1469.5322 1485.1184 1485.7955 1502.0336 1580.5916 1591.8504 1594.8327 1612.2085 1614.8205 1617.9064 1638.2385 1645.1660 2959.8129 3014.2669 3019.1117 3036.3148 3037.2904 3089.0014 3101.8313 3107.7209 3110.0834 3119.6813 3121.7007 3125.0842 3127.2058 3131.7295 3139.7036 3144.6844 3150.8409 3161.8067 3164.3644 3412.9582 3504.0066 3555.6909 3609.8876
redmass: 4.7086 5.6330 4.2580 4.2000 5.1467 6.2971 6.2570 4.8864 6.4270 5.8174 7.6799 7.8788 7.3635 6.7838 5.7366 7.0422 5.8231 5.9030 4.3595 5.6604 5.0743 5.8841 4.4502 5.8866 3.7376 2.5396 2.7601 2.6502 2.8024 2.8669 2.4072 4.1820 3.7123 4.2664 3.4007 2.3203 1.8241 5.0242 3.2799 2.3128 5.7319 5.6170 2.0238 4.4009 3.6786 1.5517 3.0381 2.6062 3.6507 1.7587 3.0264 1.2544 2.1746 3.4841 2.2236 3.7972 3.4864 4.0759 4.6969 1.3154 2.2286 1.3326 1.4637 3.0849 1.6157 1.5668 2.3537 1.8944 1.4356 2.0116 2.4641 2.8798 3.5768 1.3610 1.3115 3.0178 2.2244 2.2151 4.0680 1.5235 1.5153 1.7685 1.5807 1.1166 1.0532 1.0705 1.6400 1.1188 1.1601 1.4788 1.6134 2.0721 2.7928 1.8392 1.1657 1.4411 1.4316 1.5341 1.2749 1.2667 1.2899 1.2628 1.3339 3.1974 8.2357 8.0386 2.0116 2.1714 1.1385 1.0983 1.1701 1.2301 1.8502 2.2854 2.2560 2.0626 2.5148 5.9309 6.0921 5.8783 6.0564 2.1066 8.8896 3.9023 1.0815 1.0566 1.0613 1.0587 1.0615 1.1085 1.1028 1.0916 1.1072 1.0863 1.0858 1.1037 1.0875 1.0908 1.0922 1.0957 1.0964 1.1014 1.1016 1.0534 1.0775 1.0782 1.0980
irintensity: 0.7347 0.1006 0.1620 0.1834 0.1409 0.2111 0.2933 0.3847 0.7487 3.3514 7.9747 3.5909 10.9316 4.0105 4.4736 9.6061 8.3328 3.9619 2.9201 2.5592 13.6763 9.8022 3.0345 7.8866 2.4523 1.5051 10.2750 19.8390 0.0475 0.1190 10.8725 6.1978 4.9365 4.4747 4.5328 42.6880 82.4853 5.7921 58.0359 98.7922 4.8948 2.4587 41.7503 7.7811 17.0684 93.1087 27.9237 22.5920 84.7443 67.2938 93.5568 208.6492 63.2079 12.5673 26.3406 5.6476 8.6962 7.6143 5.3232 0.6161 3.2382 1.0298 1.2104 47.0360 16.3146 9.0731 74.2385 1.8906 1.6633 0.0717 28.2324 23.9597 19.2764 0.7303 5.6863 143.8052 6.4212 2.7510 22.7662 6.8452 8.8388 16.9322 41.6927 5.9099 0.1655 1.5081 42.1766 2.3702 0.3644 57.6296 18.0379 23.0589 19.8731 24.6679 16.4627 19.0992 26.0890 112.4278 2.1815 2.1756 31.2639 0.4998 1.0365 67.4673 0.4201 0.6872 5.2695 9.3695 43.3629 26.5088 12.8909 72.1671 717.3300 28.3666 13.5880 51.1947 136.5263 1.8399 1.6511 1.5306 0.6422 55.7393 246.6245 285.9689 19.0999 14.8679 36.3445 40.2544 19.8479 10.8055 4.2616 7.3909 6.0123 4.7466 2.3678 3.6815 1.9284 5.1568 19.7074 29.3956 26.2378 33.0763 20.9278 94.4912 123.0431 22.3098 49.7248
temp: 298.150 k
press: 1.00000 atm
elementType: 16 8 8 8 8 7 7 7 6 6 6 6 6 6 6 6 6 6 6 6 6 6 6 6 6 6 6 6 1 1 1 1 1 1 1 1 1 1 1 1 1 1 1 1 1 1 1 1 1 1 1
symmnumber: 1
zpe: 1058132.3 jmol-1
zpe.correction: 0.403021 hartree
zpe.thermalcorrener: 0.430682 hartree
zpe.thermalcorrenthalpy: 0.431626 hartree
zpe.thermalcorrgfe: 0.337116 hartree
zpe.sumelectzpe: -1637.135611 hartree
zpe.sumelectthermal: -1637.107951 hartree
zpe.sumelectthermalent: -1637.107007 hartree
zpe.sumelectthermalfe: -1637.201516 hartree
dipole: 0.4619 -0.4662 -0.7903
dipole: 1.0273
quadrupole: -182.5275 -154.9633 -163.7362
quadrupole: 5.6148 3.2928 5.7743
quadrupole: -15.4519 12.1124 3.3395 5.6148 3.2928 5.7743
hfenergy: -1637.5386325 hartree
pointgroup: C01 [X(C20H23N3O4S1)]
dipole: -0.1843688 0.0944854 -0.3470293 debye
polarizability: 293.932846|1.2357982|267.1773593|4.1201788|-27.4759868|221.8882532 unknown
InChI: InChI=1S/C20H23N3O4S/c21-18(24)11-22-19(25)17(14-28-13-16-9-5-2-6-10-16)23-20(26)27-12-15-7-3-1-4-8-15/h1-10,17,22-23H,11-14,21H2
charge 0 multiplicity 1
51 atoms
S  1.00125 -0.505608 -0.258603
O  -3.48252 1.713874 0.333623
O  0.868029 3.089624 0.576604
O  -2.917197 1.217216 -1.909508
O  5.162581 1.933666 -0.436957
N  -1.316707 1.878058 -0.336361
N  2.071549 2.84852 -1.389366
N  3.565414 2.208104 1.248694
C  -0.208782 1.881808 -1.287138
C  0.217896 0.446693 -1.704911
C  0.949754 2.656526 -0.620351
C  2.612983 -1.11019 -1.121126
C  3.451086 -1.899359 -0.141616
C  -2.590829 1.567683 -0.738852
C  3.283399 3.481796 -0.83127
C  -4.90803 1.332898 0.041668
C  3.029213 -3.182701 0.296311
C  4.673784 -1.369514 0.348269
C  -5.167105 -0.133638 0.312075
C  3.813324 -3.924022 1.206466
C  5.460803 -2.117133 1.255187
C  4.104299 2.473434 0.013355
C  5.03321 -3.393075 1.689086
C  -4.980372 -1.097713 -0.712653
C  -5.602923 -0.561332 1.591946
C  -5.223035 -2.465587 -0.457753
C  -5.845342 -1.929234 1.848267
C  -5.656381 -2.884504 0.822358
H  -0.527717 2.40974 -2.211395
H  -0.674774 -0.094394 -2.055288
H  0.953505 0.474749 -2.529458
H  -1.122134 2.214327 0.612748
H  3.156568 -0.222014 -1.483275
H  2.290836 -1.728012 -1.976762
H  2.12664 2.427359 -2.318034
H  3.920483 3.832146 -1.656758
H  2.97015 4.339668 -0.211877
H  -5.118326 1.597123 -1.008965
H  -5.476376 1.982721 0.725521
H  2.08162 -3.593463 -0.072549
H  5.01908 -0.38343 0.010074
H  3.476896 -4.913108 1.537419
H  6.409279 -1.703333 1.61625
H  5.644405 -3.969944 2.392443
H  -4.631809 -0.766397 -1.697223
H  -5.748093 0.178839 2.388617
H  -5.076426 -3.203389 -1.254595
H  -6.181994 -2.249378 2.840683
H  -5.846211 -3.945882 1.018883
H  3.986663 1.476842 1.82363
H  2.635985 2.576045 1.487764
