program: Gaussian 09
title: 000294902
version: EM64L-G09RevD.01
frameworkgroup: C1[X(C10H18N2O5)]
method: RPBEPBE
basis: SDD
operation: Freq
keyword: #p
keyword: freq=noraman
keyword: PBEPBE/SDD
title: #p freq=noraman PBEPBE/SDD
converged: YES YES NO NO
title: Mulliken charges:
elementType: O O O O O N N C C C C C C C C C C H H H H H H H H H H H H H H H H H H
charge: -0.343663 -0.191718 -0.412385 -0.219825 -0.241186 -0.444326 -0.650835 0.336472 -0.368657 -0.165015 -0.557266 -0.708413 -0.708481 -0.701780 0.236513 0.339908 0.157741 0.255320 0.234446 0.253953 0.223450 0.286705 0.211892 0.271436 0.219884 0.270816 0.211940 0.220527 0.207244 0.227574 0.226979 0.335475 0.285737 0.316091 0.383449
chargesum: 0.00000
title: Mulliken charges with hydrogens summed into heavy atoms:
elementType: O O O O O N N C C C C C C C C C C
charge: -0.343663 -0.191718 -0.028936 -0.219825 -0.241186 -0.108851 -0.049007 0.336472 0.121109 0.088938 -0.047111 -0.005201 -0.005198 -0.039983 0.236513 0.339908 0.157741
polarizability: 1.80760718e+02 -3.36601698e+00 1.36021132e+02 3.63051519e+00 3.38882926e+00 1.14813526e+02
1716.lowfreq: -14.5605 -3.5783 -0.0010 -0.0009 -0.0008 3.0137 14.3455 23.2965 37.2400
frequency: 10.5164 22.9800 37.1861 46.3025 55.5110 72.7852 84.6805 109.9190 143.2589 154.7346 177.7519 181.8789 229.2632 236.4073 246.8300 248.9776 252.0413 283.5031 305.4860 331.4946 342.0789 362.7572 411.7008 434.6984 439.5716 452.5599 487.0245 531.2415 561.7317 568.7897 626.6112 638.8570 682.1656 702.4803 711.2607 727.6081 766.4278 786.1424 805.9984 839.2944 914.6750 916.1772 928.2404 946.0273 952.8225 968.5444 1007.6996 1028.5125 1031.7628 1050.5227 1073.3804 1116.1329 1119.7074 1160.4066 1186.3927 1192.5820 1195.6857 1238.5185 1257.5171 1266.3151 1271.9887 1281.4625 1324.5621 1363.8482 1375.1407 1376.9708 1380.3275 1399.8563 1437.9563 1445.0168 1447.0875 1467.0088 1467.2326 1467.7597 1472.0707 1479.4310 1501.1959 1603.8852 1641.6010 1662.6948 1695.7939 2877.9000 2950.3419 2989.9472 2991.0320 2995.9194 3017.4377 3019.3951 3081.9099 3083.8190 3085.3870 3097.3522 3098.1837 3112.8346 3116.7812 3494.5201 3518.5375 3535.3457 3636.4983
redmass: 3.7094 4.7739 5.5930 8.0965 7.5860 4.3717 4.4761 3.8344 4.1624 3.4260 1.4687 2.2104 1.5791 1.4995 2.0042 1.2455 1.5691 4.5183 3.7367 2.5465 2.6076 3.6783 2.8876 2.8939 2.7706 3.9532 2.4748 2.6075 1.6449 2.7378 3.3013 1.7772 1.4554 4.7837 6.9037 3.3205 3.1728 1.8594 3.1023 3.8619 1.6053 2.1685 2.6450 3.3820 1.2045 5.2949 1.9631 1.4172 1.4242 2.8127 2.8321 1.6080 2.4533 2.0755 1.3750 1.6806 1.9165 1.7342 3.0398 1.4960 3.1331 1.4400 1.4124 1.6197 1.2271 1.2323 1.7821 1.2191 1.6995 1.0469 1.2111 1.0558 1.0525 1.0938 1.0778 1.0524 1.0547 1.3547 5.4479 3.5508 10.7856 1.0800 1.0605 1.0361 1.0354 1.0365 1.0716 1.0862 1.0994 1.1029 1.0992 1.0992 1.1004 1.1004 1.0996 1.0457 1.0641 1.0766 1.0996
irintensity: 0.5801 1.8275 1.5165 1.1224 0.7914 4.5639 2.2771 0.1665 3.5536 11.7898 0.6933 1.1531 3.3752 8.6749 9.7383 5.0122 6.2292 5.8715 3.5477 2.4980 1.3111 15.4933 0.8412 3.7895 4.5721 21.0493 42.4078 145.9275 28.8436 22.3396 33.1579 196.7280 25.9810 10.8977 7.5234 66.3463 3.1206 27.4724 2.0715 32.6724 1.3921 37.6428 30.6158 7.3881 0.3083 218.1217 32.6130 0.5858 10.3581 261.4705 104.6398 49.5240 624.8418 14.9281 3.7085 1.6915 2.6158 56.2255 26.7419 13.9223 22.0303 12.2962 18.0628 9.6293 42.9589 39.6267 5.5814 60.0930 633.8982 0.8397 210.3498 5.4790 3.5010 18.5494 26.8826 4.9464 32.2904 177.3063 18.4167 140.4346 289.5265 62.5799 53.1231 24.5974 9.7565 27.6766 13.5771 21.2334 9.2837 14.7810 17.5629 56.7702 32.3150 4.4616 16.0944 14.0560 30.8965 23.3654 17.5937
temp: 298.150 k
press: 1.00000 atm
elementType: 8 8 8 8 8 7 7 6 6 6 6 6 6 6 6 6 6 1 1 1 1 1 1 1 1 1 1 1 1 1 1 1 1 1 1
symmnumber: 1
zpe: 741255.0 jmol-1
zpe.correction: 0.282329 hartree
zpe.thermalcorrener: 0.302372 hartree
zpe.thermalcorrenthalpy: 0.303316 hartree
zpe.thermalcorrgfe: 0.230820 hartree
zpe.sumelectzpe: -876.169648 hartree
zpe.sumelectthermal: -876.149605 hartree
zpe.sumelectthermalent: -876.148660 hartree
zpe.sumelectthermalfe: -876.221156 hartree
dipole: 0.6003 4.0181 0.0237
dipole: 4.0628
quadrupole: -79.2095 -108.4511 -101.0193
quadrupole: -12.4709 -5.8894 -8.9534
quadrupole: 17.0171 -12.2244 -4.7927 -12.4709 -5.8894 -8.9534
hfenergy: -876.4519766 hartree
pointgroup: C01 [X(C10H18N2O5)]
dipole: 0.2163282 1.5732791 -0.1815667 debye
polarizability: 180.6337442|-2.2348319|136.4509665|5.4431005|0.696084|114.5106642 unknown
InChI: InChI=1S/C10H18N2O5/c1-10(2,3)17-9(16)12-7(13)5-4-6(11)8(14)15/h6,12,14H,4-5,11H2,1-3H3
charge 0 multiplicity 1
35 atoms
O  -2.871948 0.594406 0.082794
O  0.345447 -2.254542 -0.069185
O  4.38072 1.270359 -1.432294
O  -2.552994 -1.749481 -0.091104
O  4.890351 1.892934 0.743728
N  -0.765722 -0.184064 0.092711
N  4.259706 -0.596998 1.726056
C  -4.397467 0.53257 0.025127
C  2.899958 -0.951165 -0.342711
C  4.242531 -0.452404 0.269588
C  1.685912 -0.217076 0.251555
C  -4.829479 -0.075195 -1.324189
C  -4.918289 -0.270077 1.233729
C  -4.777587 2.019529 0.124828
C  0.38715 -1.007655 0.06405
C  -2.117799 -0.587812 0.015192
C  4.529894 1.009936 -0.066732
H  2.795789 -2.028966 -0.119885
H  2.934424 -0.842781 -1.440744
H  5.053345 -1.024948 -0.245205
H  1.589216 0.803044 -0.169425
H  1.872669 -0.110224 1.342484
H  -5.929471 -0.015676 -1.415968
H  -4.526755 -1.131241 -1.400205
H  -4.383878 0.488742 -2.162878
H  -4.618439 -1.327693 1.168408
H  -6.022094 -0.217675 1.258856
H  -4.53222 0.156116 2.176682
H  -5.876333 2.127654 0.09259
H  -4.409806 2.453199 1.070727
H  -4.343635 2.589499 -0.714756
H  -0.63031 0.825326 0.191971
H  4.390075 -1.547354 2.072961
H  4.774764 0.128736 2.230451
H  4.624776 2.218279 -1.613211
