program: Gaussian 09
title: 000294894
version: EM64L-G09RevD.01
frameworkgroup: C1[X(C9H17NO4)]
method: RPBEPBE
basis: SDD
operation: Freq
keyword: #p
keyword: freq=noraman
keyword: PBEPBE/SDD
title: #p freq=noraman PBEPBE/SDD
converged: YES YES NO NO
title: Mulliken charges:
elementType: O O O O N C C C C C C C C C H H H H H H H H H H H H H H H H H
charge: -0.337594 -0.302308 -0.419583 -0.228526 -0.385914 0.340116 -0.710407 -0.703714 -0.710619 -0.359679 -0.413026 -0.472994 0.324778 0.182871 0.270464 0.217839 0.207949 0.226109 0.226297 0.204380 0.270874 0.208404 0.217089 0.253668 0.225618 0.209878 0.258612 0.239956 0.263017 0.319399 0.377046
chargesum: 0.00000
title: Mulliken charges with hydrogens summed into heavy atoms:
elementType: O O O O N C C C C C C C C C
charge: -0.337594 -0.302308 -0.042537 -0.228526 -0.066515 0.340116 -0.014155 -0.046928 -0.014251 0.119607 0.055464 0.029979 0.324778 0.182871
polarizability: 1.40470090e+02 4.33968577e+00 1.07826057e+02 8.89950134e-01 -4.28590466e+00 1.06656417e+02
1716.lowfreq: -1.6648 -0.0007 -0.0005 -0.0001 3.9446 13.6278 15.5885 20.0369 31.9818
frequency: 15.5387 19.2520 31.9016 59.8411 84.9278 104.4203 122.4527 138.3621 181.1963 190.2470 225.8477 243.6225 255.8361 276.3471 304.0968 330.6735 343.0706 409.1853 425.1305 433.4011 452.6910 503.6625 510.7545 531.4535 589.7934 639.8604 670.0377 706.0060 730.9991 763.7237 814.0221 848.5440 881.4572 915.4231 916.1337 922.9087 954.6099 975.1514 1030.9085 1033.2907 1040.7341 1083.2655 1107.1198 1120.8322 1163.4843 1170.5760 1213.5803 1238.1088 1256.8181 1269.1569 1274.5587 1281.0820 1327.1456 1364.0044 1373.6930 1375.5987 1379.9264 1397.8183 1441.6835 1445.4588 1448.5720 1466.9881 1467.8506 1469.4900 1470.6907 1475.5212 1481.3809 1504.4245 1648.7576 1671.5017 2984.3719 2987.9025 2989.2531 2994.1016 3001.2681 3012.1492 3037.6652 3067.8394 3079.5097 3081.7763 3082.9374 3095.8422 3097.3830 3112.7085 3116.1842 3513.1262 3578.6110
redmass: 10.7098 4.7393 4.3327 4.8339 2.6811 2.8470 3.9062 3.9930 3.3006 1.0616 5.0352 1.0872 1.0617 2.5294 3.4591 2.5724 2.6887 2.7168 4.4215 2.8216 2.6198 1.9445 2.2844 1.1973 3.9386 1.3238 5.1134 9.5124 4.2771 1.7071 2.7887 2.5265 3.4968 2.8442 1.6753 1.6269 1.2026 2.7319 1.4155 1.4295 2.3905 2.2361 2.4529 4.6665 2.1216 1.3006 1.9693 1.5001 3.0362 1.8937 1.5467 1.4040 1.4283 1.4117 1.2276 1.2558 1.5391 1.2166 1.0925 1.0470 1.1534 1.0571 1.0575 1.0904 1.0624 1.7053 1.0518 1.0617 8.0385 8.2597 1.0621 1.0361 1.0355 1.0363 1.0616 1.0626 1.0955 1.1012 1.0993 1.1030 1.0990 1.0993 1.1003 1.1001 1.0994 1.0639 1.0777
irintensity: 0.6862 0.2727 0.8625 6.6835 0.5811 1.1283 0.7344 2.6049 7.0227 0.3267 2.0984 0.3560 0.1247 4.4041 7.1661 2.4841 13.5801 0.9047 31.7308 2.9096 1.0501 25.0077 7.7800 144.7573 6.1789 129.8384 6.1201 22.3876 4.6794 18.3193 4.6324 23.8707 29.8760 24.2965 1.5788 2.3862 0.2451 96.4832 1.3060 9.6958 236.7105 11.2852 28.0409 170.1882 341.6984 27.4518 45.4654 13.8463 27.0394 30.3186 6.9881 24.3794 69.2520 7.0475 41.0605 51.4916 19.5926 30.3043 34.6089 1.7554 43.9909 3.2929 17.5448 20.4954 10.5418 262.9871 3.8122 47.3039 198.7432 227.8998 12.0959 27.0071 10.7442 32.4802 39.1580 18.1281 1.8081 14.6639 11.5174 37.4206 14.7655 55.7512 33.5450 4.6510 15.5535 19.7867 30.1120
temp: 298.150 k
press: 1.00000 atm
elementType: 8 8 8 8 7 6 6 6 6 6 6 6 6 6 1 1 1 1 1 1 1 1 1 1 1 1 1 1 1 1 1
symmnumber: 1
zpe: 674988.3 jmol-1
zpe.correction: 0.257089 hartree
zpe.thermalcorrener: 0.273878 hartree
zpe.thermalcorrenthalpy: 0.274822 hartree
zpe.thermalcorrgfe: 0.210024 hartree
zpe.sumelectzpe: -707.709945 hartree
zpe.sumelectthermal: -707.693157 hartree
zpe.sumelectthermalent: -707.692212 hartree
zpe.sumelectthermalfe: -707.757011 hartree
dipole: 0.5274 1.1406 -3.2681
dipole: 3.5014
quadrupole: -77.8418 -81.3989 -88.9984
quadrupole: 0.8003 6.6626 6.0721
quadrupole: 4.9045 1.3475 -6.2520 0.8003 6.6626 6.0721
hfenergy: -707.9670346 hartree
pointgroup: C01 [X(C9H17N1O4)]
dipole: -0.2088103 0.4879516 1.2711911 debye
polarizability: 140.3937134|-4.5744738|108.144755|1.184186|4.2181164|106.4140962 unknown
InChI: InChI=1S/C9H17NO4/c1-9(2,3)14-8(13)10-6-4-5-7(11)12/h10-11H,4-6H2,1-3H3
charge 0 multiplicity 1
31 atoms
O  -2.017124 0.173861 0.66827
O  -1.194447 -1.228443 -1.073239
O  4.460202 1.744886 0.516632
O  4.444269 0.261982 -1.269904
N  -0.081591 -0.96046 0.969776
C  -3.258328 0.615892 -0.093339
C  -4.139939 -0.612406 -0.39623
C  -3.932647 1.558586 0.918849
C  -2.834981 1.368619 -1.371144
C  2.160512 -1.17539 -0.181195
C  1.033811 -1.858217 0.628308
C  2.813112 -0.008734 0.581572
C  -1.107638 -0.717936 0.076347
C  3.958904 0.629547 -0.178719
H  -3.633488 -1.296212 -1.095368
H  -4.374269 -1.157831 0.535344
H  -5.091705 -0.279714 -0.849841
H  -3.264469 2.400246 1.170559
H  -4.179428 1.017619 1.848747
H  -4.86571 1.96551 0.489726
H  -2.318249 0.693924 -2.071666
H  -3.73127 1.780947 -1.870143
H  -2.164121 2.209406 -1.119227
H  1.74759 -0.81741 -1.140967
H  2.926724 -1.932619 -0.43262
H  1.434962 -2.275714 1.571472
H  0.626084 -2.693309 0.031828
H  3.211613 -0.342031 1.561549
H  2.072626 0.782024 0.808121
H  -0.128498 -0.500078 1.87846
H  5.214594 2.138455 -0.000857
