program: Gaussian 09
title: 000294934
version: EM64L-G09RevD.01
frameworkgroup: C1[X(C17H24N2O5)]
method: RPBEPBE
basis: SDD
operation: Freq
keyword: #p
keyword: freq=noraman
keyword: PBEPBE/SDD
title: #p freq=noraman PBEPBE/SDD
converged: YES YES NO NO
title: Mulliken charges:
elementType: O O O O O N N C C C C C C C C C C C C C C C C C H H H H H H H H H H H H H H H H H H H H H H H H
charge: -0.253784 -0.246675 -0.307708 -0.286407 -0.321971 -0.404305 -0.366385 -0.039269 -0.161271 -0.723017 -0.693842 0.185159 0.284628 -0.527998 -0.384128 -0.497930 0.308664 -0.474742 0.464128 -0.367343 -0.387150 -0.230960 -0.227051 -0.235270 0.230611 0.297388 0.222471 0.227169 0.215906 0.220377 0.212805 0.233743 0.326939 0.220354 0.258588 0.256449 0.227275 0.373183 0.239217 0.247250 0.243154 0.216985 0.240579 0.275421 0.232395 0.225303 0.224522 0.226545
chargesum: 0.00000
title: Mulliken charges with hydrogens summed into heavy atoms:
elementType: O O O O O N N C C C C C C C C C C C C C C C C C
charge: -0.253784 -0.246675 -0.307708 -0.286407 -0.321971 -0.077366 0.006798 0.191342 0.136116 -0.057471 -0.026918 0.185159 0.284628 -0.049056 0.099595 0.231692 0.308664 -0.017178 0.464128 -0.091922 -0.154756 -0.005657 -0.002529 -0.008725
polarizability: 2.43008341e+02 -1.91491521e+01 2.00388722e+02 -2.56616260e+00 -6.72416908e+00 1.91728494e+02
1716.lowfreq: -5.3304 -2.8315 -0.0005 -0.0004 0.0005 2.5756 9.0675 20.0849 22.9298
frequency: 8.5752 18.4276 22.6811 26.5083 43.6194 49.3465 58.9943 62.8974 69.2567 81.9177 86.9283 102.9916 109.2452 116.5141 153.1295 160.9015 195.7800 204.4990 217.8097 221.5134 238.4588 261.3727 276.8087 288.0092 301.4476 318.8231 335.0427 366.8409 395.9891 403.9836 407.9908 453.1811 466.7211 517.1071 559.3973 587.2539 597.1679 616.0732 617.3865 633.2711 646.5954 681.3908 696.3335 705.1494 717.8316 729.4437 757.2940 807.2404 815.1388 826.4061 847.9693 858.0940 873.5609 917.5404 920.5663 934.1211 944.8069 959.9771 960.8096 977.1419 981.0495 983.4733 990.2541 999.2004 1011.0911 1026.8609 1043.3272 1052.5824 1089.6617 1112.5589 1116.4868 1123.9529 1140.8706 1151.0257 1171.9402 1175.3070 1181.9110 1188.0224 1190.0206 1194.2174 1220.0395 1228.8458 1240.3921 1265.9631 1268.4773 1294.8656 1317.5123 1330.0547 1339.4451 1346.3225 1350.9817 1369.7701 1385.0153 1386.2713 1405.1482 1423.6729 1431.0177 1441.3537 1453.1759 1458.4044 1459.5957 1462.7044 1469.2878 1471.6927 1474.2474 1480.6007 1484.0855 1488.9636 1493.7372 1594.0442 1600.8001 1614.2281 1629.5549 1655.1755 2976.5029 2984.4777 2988.1752 2993.7295 2999.4487 3008.8396 3030.1465 3031.3737 3049.2364 3069.6578 3075.4943 3081.1822 3081.8047 3090.2180 3104.2661 3113.1025 3118.1857 3125.7675 3138.7600 3150.3992 3156.3770 3163.0171 3507.6741 3518.8986
redmass: 5.3611 4.4076 4.5374 4.5889 4.4340 3.7310 2.7177 4.2175 6.3107 2.6968 1.7674 3.9460 3.9615 3.3988 5.3471 5.4186 4.4513 1.2328 3.3679 2.8274 1.1545 4.3591 4.5856 3.9813 3.3421 3.3138 4.1826 2.4039 2.5601 2.8177 4.0274 3.5752 2.3374 4.3682 3.8442 2.6969 4.0415 1.6745 6.2453 5.1490 2.7028 4.1361 7.8862 1.9095 4.8809 1.1146 2.1474 3.5797 3.4534 3.1316 4.6531 1.2582 3.6508 4.4112 1.2215 1.5461 2.0883 2.7304 1.7891 2.3909 1.8439 1.9247 4.9098 1.3656 2.4878 2.2118 1.9266 2.3470 1.5213 1.3923 2.3754 2.6989 3.7322 1.4400 1.0540 2.3171 1.7728 1.1565 1.8853 1.2241 2.9216 1.8676 1.1594 1.4041 1.2978 1.5307 1.4708 1.2550 1.4941 1.2340 1.5383 1.3657 7.9191 1.2089 1.2116 1.1957 1.1009 2.1722 1.0500 1.1773 1.0931 1.0533 1.6279 1.1289 1.1054 1.0523 2.2408 1.1111 1.8284 6.0945 5.8284 6.0641 8.2828 9.2689 1.0360 1.0359 1.0607 1.0661 1.0841 1.0295 1.0831 1.0586 1.0997 1.0997 1.0996 1.0989 1.0978 1.0999 1.1071 1.1049 1.0856 1.0878 1.0924 1.0962 1.1051 1.1015 1.0780 1.0772
irintensity: 0.1823 0.0181 0.1537 0.0497 0.1510 2.2271 0.9599 0.1892 2.1904 2.4410 3.4438 6.5749 11.2380 3.4010 3.4820 1.8872 7.8896 0.5041 3.1487 5.1038 0.5621 3.1518 7.7736 17.8392 18.9671 5.1108 20.6067 18.7818 0.5986 0.1265 14.9723 3.0792 1.1511 7.5829 13.5729 4.7674 18.2772 71.0817 0.4473 9.6965 28.5432 6.1899 21.1283 68.4019 14.2237 161.3472 63.9400 20.6582 8.8089 2.9900 1.4747 0.3475 7.6567 2.4009 3.2508 21.6996 1.0963 127.2896 4.9473 86.1227 2.3019 35.1146 3.6757 1.0448 19.2561 4.2800 21.5776 119.9507 10.3946 1.5588 7.5088 10.5445 184.3008 11.1731 0.2142 104.2677 49.0099 3.7440 7.7593 13.1523 35.9567 131.5311 8.6129 207.8869 6.0209 121.2794 10.7492 2.4574 18.8938 11.8936 34.9035 4.0243 0.5858 21.7663 16.9146 27.9156 31.5799 9.6454 14.0045 61.5824 9.8138 20.0205 584.3037 41.8128 67.9388 26.8391 33.0684 28.9275 106.3603 1.8590 145.9226 0.6246 122.4212 315.4691 23.8678 20.3121 21.7278 41.5536 8.5006 32.1053 16.5770 40.8608 28.2254 29.3799 9.1406 72.8139 3.8759 27.2022 7.2410 22.5135 3.8295 3.3541 25.1471 23.5005 12.8431 22.7761 183.2719 48.2783
temp: 298.150 k
press: 1.00000 atm
elementType: 8 8 8 8 8 7 7 6 6 6 6 6 6 6 6 6 6 6 6 6 6 6 6 6 1 1 1 1 1 1 1 1 1 1 1 1 1 1 1 1 1 1 1 1 1 1 1 1
symmnumber: 1
zpe: 1029071.2 jmol-1
zpe.correction: 0.391953 hartree
zpe.thermalcorrener: 0.417910 hartree
zpe.thermalcorrenthalpy: 0.418854 hartree
zpe.thermalcorrgfe: 0.330483 hartree
zpe.sumelectzpe: -1146.041352 hartree
zpe.sumelectthermal: -1146.015395 hartree
zpe.sumelectthermalent: -1146.014451 hartree
zpe.sumelectthermalfe: -1146.102822 hartree
dipole: 5.2596 2.4909 0.5569
dipole: 5.8462
quadrupole: -117.4121 -140.0184 -140.9973
quadrupole: -6.5198 -0.4311 1.9845
quadrupole: 15.3971 -7.2091 -8.1880 -6.5198 -0.4311 1.9845
hfenergy: -1146.433305 hartree
pointgroup: C01 [X(C17H24N2O5)]
dipole: -1.6520403 1.5922749 0.1604261 debye
polarizability: 250.0916953|3.0764036|190.5223382|-2.6758903|6.8150203|194.5115245 unknown
InChI: InChI=1S/C17H24N2O5/c1-12(2)15(16(21)23-3)19-14(20)9-10-18-17(22)24-11-13-7-5-4-6-8-13/h4-8,12,15,18-19H,9-11H2,1-3H3
charge 0 multiplicity 1
48 atoms
O  -5.628631 1.768412 1.480968
O  -5.332827 1.104199 -0.731709
O  -1.276293 -0.511656 1.110889
O  2.794766 -2.404975 0.725476
O  2.28384 -3.173649 -1.452986
N  -2.651251 0.692825 -0.32471
N  0.671559 -2.189921 -0.052117
C  -2.868801 2.858097 1.006918
C  -3.369418 1.388785 0.750635
C  -3.055982 3.761685 -0.233016
C  -1.397979 2.850813 1.47752
C  -4.857457 1.383311 0.395663
C  -1.667396 -0.243439 -0.073075
C  -1.068195 -0.917969 -1.314216
C  -0.45059 -2.297885 -0.987272
C  -7.094338 1.841814 1.245256
C  1.929353 -2.63256 -0.367114
C  4.225368 -2.787824 0.496104
C  5.031251 -1.643365 -0.08362
C  5.099161 -1.452048 -1.488641
C  5.728144 -0.749815 0.768752
C  5.848567 -0.382968 -2.027732
C  6.478069 0.320201 0.230793
C  6.540162 0.505223 -1.170126
H  -3.503794 3.244102 1.829139
H  -3.21068 0.812841 1.681649
H  -2.721224 4.78984 -0.006243
H  -4.110679 3.815746 -0.560872
H  -2.450127 3.394914 -1.082742
H  -0.72914 2.480376 0.6797
H  -1.078057 3.875938 1.739852
H  -1.255104 2.2018 2.359105
H  -3.048672 0.774729 -1.265096
H  -1.840894 -1.034301 -2.098992
H  -0.2783 -0.260306 -1.726687
H  -0.066561 -2.766309 -1.90911
H  -1.230915 -2.95957 -0.563583
H  0.482971 -1.733286 0.846026
H  -7.512736 2.183638 2.201538
H  -7.482376 0.846662 0.972253
H  -7.313669 2.554694 0.433159
H  4.57282 -3.060025 1.505598
H  4.238849 -3.668992 -0.168567
H  4.548176 -2.136773 -2.143135
H  5.679195 -0.891954 1.855551
H  5.896345 -0.243774 -3.113775
H  7.014102 1.004003 0.898744
H  7.124185 1.332615 -1.589454
