program: Gaussian 09
title: 000027315
version: EM64L-G09RevD.01
frameworkgroup: C1[X(C4H4N4O6)]
method: RPBEPBE
basis: SDD
operation: Freq
keyword: #pfreq=noraman
keyword: PBEPBE/SDD
title: #p freq=noraman PBEPBE/SDD
converged: YES YES NO NO
title: Mulliken charges:
elementType: O O O O O O N N N N C C C C H H H H
charge: -0.118778 -0.139753 -0.153631 -0.155402 -0.120316 -0.118311 0.110591 0.115393 0.103194 0.011720 0.301615 -0.406899 -0.430297 -0.146371 0.280324 0.292506 0.271378 0.303034
chargesum: 0.00000
title: Mulliken charges with hydrogens summed into heavy atoms:
elementType: O O O O O O N N N N C C C C
charge: -0.118778 -0.139753 -0.153631 -0.155402 -0.120316 -0.118311 0.110591 0.115393 0.103194 0.011720 0.301615 0.165931 0.144115 -0.146371
polarizability: 1.14720909e+02 -4.97734598e+00 8.62580890e+01 5.05377151e-01 -1.96414735e+00 8.17922872e+01
1716.lowfreq: -11.8851 -2.3668 -0.0009 -0.0005 0.0010 3.1735 14.2833 34.2549 42.8917
frequency: 10.7053 34.0391 42.8478 83.9277 93.7908 108.0179 158.5118 161.0354 186.5993 221.6670 263.0549 295.8366 332.5190 344.4486 357.1325 368.6452 445.6243 529.8543 563.0226 584.1406 687.7330 693.5709 716.7412 742.1122 764.2746 817.1183 819.1426 962.2994 1027.4848 1041.8281 1122.9359 1158.2184 1161.1817 1208.7991 1216.4687 1276.0150 1305.4172 1355.4645 1429.8166 1438.1140 1443.9812 1452.4551 1459.6558 2209.9030 3015.6567 3030.0554 3079.6373 3099.3961
redmass: 9.8000 7.1609 9.0255 14.7611 8.1576 3.5558 11.9004 11.5000 10.8071 9.8975 3.2958 7.6583 12.9291 14.6953 12.9367 3.9440 7.6398 9.6602 6.9581 11.3791 6.0002 4.1704 14.2183 3.1072 12.5768 3.9562 3.4614 4.7052 4.8630 2.0886 6.0466 13.8168 14.0642 1.1944 9.7268 1.2789 1.1486 1.3542 3.3561 7.3772 3.4154 2.1494 1.1376 12.4444 1.0610 1.0601 1.0994 1.1025
irintensity: 0.9383 4.0504 4.6280 0.3430 3.8883 1.1287 5.2446 3.0811 5.3589 5.9199 0.5203 0.8801 1.9088 0.7423 0.0411 0.8783 0.6432 6.3888 0.4971 3.2177 10.1377 8.5993 60.9170 64.7420 11.8575 13.4517 10.1595 3.8676 0.8313 0.2875 11.2157 117.3550 117.8026 2.9096 12.8750 33.6172 5.2411 1.7771 148.0970 124.7477 76.9155 64.4655 42.0300 4.6524 1.9577 5.5341 1.9131 1.0578
temp: 298.150 k
press: 1.00000 atm
elementType: 8 8 8 8 8 8 7 7 7 7 6 6 6 6 1 1 1 1
symmnumber: 1
zpe: 268686.6 jmol-1
zpe.correction: 0.102337 hartree
zpe.thermalcorrener: 0.116497 hartree
zpe.thermalcorrenthalpy: 0.117441 hartree
zpe.thermalcorrgfe: 0.058215 hartree
zpe.sumelectzpe: -823.803913 hartree
zpe.sumelectthermal: -823.789753 hartree
zpe.sumelectthermalent: -823.788809 hartree
zpe.sumelectthermalfe: -823.848036 hartree
dipole: -0.1702 -0.3572 -0.0556
dipole: 0.3995
quadrupole: -104.5899 -84.6964 -84.8751
quadrupole: 4.7552 -1.0627 -0.0930
quadrupole: -13.2028 6.6907 6.5120 4.7552 -1.0627 -0.0930
hfenergy: -823.9062503 hartree
pointgroup: C01 [X(C4H4N4O6)]
dipole: -0.0658478 -0.1162793 -0.0827782 debye
dipolederiv: -0.5435523 -0.2376711 0.1327064 -0.2442741 -0.2430997 -0.0366086 0.1916181 0.0032337 -0.4499285 -0.4134215 -0.0122513 -0.1320668 0.1263591 -0.6988532 0.0906572 -0.1742092 0.0399065 -0.2149065 -0.3489423 0.1271636 0.1445409 0.0874472 -0.360106 0.1353975 0.2828026 0.0212538 -0.6216609 -0.5810549 -0.1888128 0.01521 -0.2910169 -0.3104956 -0.1265635 -0.1300587 -0.1871678 -0.4986025 -0.5457842 0.0301792 -0.282299 -0.0285251 -0.4213647 0.0235191 -0.2917622 0.0471202 -0.2708032 -0.2749612 0.225235 0.1630698 0.2614038 -0.4935472 -0.0516674 0.1243647 0.0152131 -0.4008839 0.9039719 0.4627273 -0.2167205 0.5728919 0.3221897 0.259255 -0.0941212 0.2428949 1.1208708 0.8392127 0.1617828 0.5439334 0.0558736 1.2495896 -0.0080923 0.5735317 0.0130082 0.2970292 0.383384 -0.4681232 -0.299105 -0.403218 0.9317391 -0.2721599 -0.4424694 -0.2460494 0.960049 -0.2352395 -0.0279713 -0.0055513 0.024216 -0.1982946 0.0017199 0.0038798 0.0043322 -0.2084506 0.369753 -0.1238569 -0.0430398 -0.2177466 -0.077316 0.0137705 -0.0536889 0.0224212 0.0152597 -0.0249729 0.0462439 0.0016121 0.0845589 -0.1060044 -0.0740631 0.0320075 0.0294527 -0.0777356 0.0469698 0.0281886 0.0127916 0.161758 0.1552753 -0.0307109 0.0709097 -0.0506099 0.1839411 0.0908321 -0.082123 -0.0344382 -0.1502152 -0.0459334 0.0116573 -0.0317094 0.0156264 -0.0398651 0.0636455 -0.0170019 0.0173602 -0.0251602 0.099842 -0.0159634 -0.0347604 -0.0408778 0.0214316 0.075868 0.0052673 -0.006612 -0.0262555 0.0514007 0.0619149 0.0113302 0.0394476 0.0857051 0.0666375 0.0421043 -0.0180772 0.0139949 0.0391947 0.034974 0.0124138 0.0728979 0.0518965 0.1276544 0.0289197 0.0066856 -0.0020919 0.1057836 -0.0170362 -0.0500787 -0.0421037 0.046654 unknown
polarizability: 114.7523077|-2.8777198|86.4332613|-4.2329891|0.9134685|81.5857165 unknown
InChI: InChI=1S/C4H4N4O6/c5-3-1-2-4(6(9)10,7(11)12)8(13)14/h1-2H2
charge 0 multiplicity 1
18 atoms
O  1.923322 0.353251 -1.956064
O  1.068187 2.461919 0.127324
O  0.351717 -1.169299 1.998411
O  0.036088 -0.922808 -2.148044
O  2.466052 0.944833 1.12091
O  1.590536 -2.012744 0.265906
N  0.848401 -0.165238 -1.512761
N  1.429568 1.285372 0.466289
N  0.838103 -1.144355 0.815256
N  -4.499568 0.407901 0.424243
C  0.456206 0.128869 -0.018883
C  -0.998654 0.553536 0.175548
C  -2.060662 -0.568042 -0.022478
C  -3.408171 -0.029501 0.226256
H  -1.081155 0.944884 1.205313
H  -1.194719 1.397571 -0.50824
H  -1.882581 -1.400406 0.683426
H  -2.016071 -0.977741 -1.045311
