program: Gaussian 09
title: 000295001
version: EM64L-G09RevD.01
frameworkgroup: C1[X(C22H12Cl2F6N2O2)]
method: RPBEPBE
basis: SDD
operation: Freq
keyword: #p
keyword: freq=noraman
keyword: PBEPBE/SDD
title: #p freq=noraman PBEPBE/SDD
converged: YES YES NO NO
title: Mulliken charges:
elementType: Cl Cl F F F F F F O O N N C C C C C C C C C C C C C C C C C C C C C C H H H H H H H H H H H H
charge: -0.047010 -0.047999 -0.165319 -0.162508 -0.156011 -0.165358 -0.157967 -0.160992 -0.241723 -0.249838 -0.478499 -0.478225 0.273570 0.276077 0.674282 0.671392 -0.472571 0.342562 0.336818 0.098609 0.110425 -0.458224 -0.432580 -0.345345 -0.335522 -0.405282 -0.407574 -0.217997 -0.355924 -0.377607 -0.201852 -0.199722 0.251347 0.250929 0.213852 0.344519 0.343562 0.322429 0.316915 0.282625 0.285667 0.246072 0.272935 0.274984 0.266116 0.265966
chargesum: 0.00000
title: Mulliken charges with hydrogens summed into heavy atoms:
elementType: Cl Cl F F F F F F O O N N C C C C C C C C C C C C C C C C C C C C C C
charge: -0.047010 -0.047999 -0.165319 -0.162508 -0.156011 -0.165358 -0.157967 -0.160992 -0.241723 -0.249838 -0.156070 -0.161310 0.273570 0.276077 0.674282 0.671392 -0.258719 0.342562 0.336818 0.098609 0.110425 -0.113705 -0.089018 -0.062720 -0.049855 -0.405282 -0.407574 0.028075 -0.082989 -0.102623 0.064263 0.066243 0.251347 0.250929
polarizability: 4.40844214e+02 3.02734603e+00 3.46687203e+02 -7.59501433e+00 4.60806563e+00 1.32630052e+02
1716.lowfreq: -5.5237 -3.2913 -0.0019 -0.0018 -0.0018 1.5919 5.1684 8.1044 11.4306
frequency: -1.3981 8.0150 11.3842 17.3685 24.3454 33.8810 49.5979 51.6088 72.6513 73.0879 73.8713 86.0879 89.0413 119.7989 139.4360 161.1348 165.6466 189.5000 192.6681 209.1038 213.0472 214.2171 260.1187 263.5736 278.6475 285.4542 292.9537 331.2171 337.8444 342.7619 351.8124 353.2528 379.6204 410.0824 413.7775 424.6629 439.9804 442.2430 450.7512 465.8224 477.9274 487.8858 490.4088 510.8635 531.8747 537.6561 585.4927 594.6028 629.4485 630.3202 630.5745 632.0490 654.6157 668.5885 675.5849 690.8347 700.9929 714.3257 718.6913 735.3934 738.3193 739.1865 758.7274 817.6952 820.5897 841.1119 846.1981 881.3969 888.9549 908.0192 915.2437 945.9003 946.5106 956.3172 957.3908 970.7097 989.3730 989.5819 991.2333 1008.9738 1010.7750 1016.3328 1024.9758 1030.7860 1051.7760 1054.7325 1077.5364 1091.3324 1118.1823 1154.1303 1156.5816 1183.2916 1209.5222 1228.5509 1243.2024 1251.5748 1258.1769 1282.2455 1304.5842 1308.5768 1319.6425 1376.0525 1380.7642 1389.6944 1414.4785 1426.8691 1431.2469 1442.1519 1449.2929 1477.2318 1517.4052 1525.0883 1578.2652 1586.4039 1594.2085 1596.5437 1609.9546 1612.1737 1615.7730 1620.3415 3105.7202 3149.4774 3164.4321 3167.9062 3170.7111 3176.6490 3183.9233 3185.9724 3188.4398 3188.9418 3492.3818 3501.5747
redmass: 17.6597 15.4693 14.5992 18.1018 11.6203 10.1445 5.9962 9.5207 9.4633 13.7332 8.7182 8.1365 8.1395 12.1540 5.3074 7.1469 9.0088 8.6378 7.8592 9.8925 9.0054 9.1405 17.1973 17.8946 5.2466 5.4276 10.3044 6.7156 12.0247 12.2345 8.3432 8.2131 8.2958 7.1445 7.3279 3.3411 4.4242 4.5147 6.9364 8.2900 10.5890 5.5497 5.6650 7.7311 8.7653 7.9932 7.2190 6.5764 5.1173 5.8824 7.8453 4.3613 6.4967 3.2204 1.5675 1.6223 8.0338 8.2700 2.1273 4.2592 3.8245 5.0968 7.9630 1.3665 1.3521 1.5350 7.0878 3.5250 7.0823 2.3160 6.1069 1.4358 1.4320 1.4267 1.3775 1.3983 6.3473 6.6559 8.8572 7.2541 7.2390 1.3792 5.9452 5.5685 4.5445 4.0141 2.3643 2.1105 1.9306 1.4047 1.3997 1.0924 2.2128 2.4810 1.9413 1.5792 1.9374 3.6049 2.1026 2.5641 1.3986 6.9277 8.1894 8.9019 3.2262 5.3394 5.2558 2.4670 2.6417 2.5896 2.3007 2.3605 6.3940 8.3753 5.4187 4.7181 6.5888 7.2157 5.0413 5.5324 1.0904 1.0875 1.0924 1.0891 1.0891 1.0994 1.0932 1.0970 1.0942 1.0979 1.0759 1.0755
irintensity: 0.0493 0.6942 0.2275 0.0329 0.2552 0.1570 2.3942 0.3526 0.4528 0.4665 0.0947 4.8124 6.7520 0.0878 0.9469 3.6849 5.3385 2.6375 1.4405 0.2808 0.4379 0.3383 0.6727 2.7408 0.4844 2.9622 4.6899 9.9103 2.5111 13.2494 2.7975 3.0326 3.8017 13.4645 3.3633 0.0547 0.7826 11.6890 4.1894 54.5002 3.6661 11.4731 0.5361 1.3906 0.5367 6.0518 23.2034 4.9414 1.2856 3.4105 6.0829 0.9269 7.8797 6.8670 21.8007 43.8398 3.3371 3.8544 108.4225 2.7908 25.0124 16.2097 0.0970 51.1972 62.1338 19.2471 3.8691 22.9218 144.9393 11.9696 4.4625 41.8545 73.0280 47.7068 21.2700 0.2424 93.7157 62.9301 204.6012 133.9543 38.9127 2.9435 100.7895 98.2552 146.5635 197.1338 37.3680 8.0702 0.6592 2.0281 0.6803 15.0154 449.1518 18.2689 76.3492 25.7628 46.3715 139.8123 241.2304 41.6321 66.0009 96.8433 167.4171 3.6260 3.8238 227.3145 246.0399 14.8951 54.1671 49.7136 301.2842 498.0747 26.6335 2.5191 39.7232 105.3632 116.3902 44.1495 141.6017 8.9683 10.3962 5.9419 0.8023 0.1253 0.2289 8.7162 18.1193 1.1710 18.4059 1.1742 32.2357 35.1283
temp: 298.150 k
press: 1.00000 atm
elementType: 17 17 9 9 9 9 9 9 8 8 7 7 6 6 6 6 6 6 6 6 6 6 6 6 6 6 6 6 6 6 6 6 6 6 1 1 1 1 1 1 1 1 1 1 1 1
symmnumber: 1
zpe: 781318.3 jmol-1
zpe.correction: 0.297588 hartree
zpe.thermalcorrener: 0.327065 hartree
zpe.thermalcorrenthalpy: 0.328009 hartree
zpe.thermalcorrgfe: 0.231747 hartree
zpe.sumelectzpe: -2622.338699 hartree
zpe.sumelectthermal: -2622.309222 hartree
zpe.sumelectthermalent: -2622.308278 hartree
zpe.sumelectthermalfe: -2622.404541 hartree
dipole: -0.2751 -3.4590 -3.0901
dipole: 4.6464
quadrupole: -282.2558 -185.7952 -214.0371
quadrupole: -1.1717 5.4420 -3.9868
quadrupole: -54.8931 41.5675 13.3256 -1.1717 5.4420 -3.9868
hfenergy: -2622.6362873 hartree
pointgroup: C01 [X(C22H12Cl2F6N2O2)]
dipole: -0.1197976 1.2797842 1.2998045 debye
polarizability: 440.8901603|-2.6954656|345.1825696|7.3779573|18.2236901|134.0887393 unknown
InChI: InChI=1S/C22H12Cl2F6N2O2/c23-15-6-4-13(21(25,26)27)9-17(15)31-19(33)11-2-1-3-12(8-11)20(34)32-18-10-14(22(28,29)30)5-7-16(18)24/h1-10,31-32H
charge 0 multiplicity 1
46 atoms
Cl -1.958748 2.269108 1.62125
Cl 1.695968 2.554241 0.660296
F  -8.44842 1.201094 -0.060563
F  -7.476976 1.095422 -2.101985
F  -7.563914 -0.756622 -0.799419
F  8.395301 1.664215 -0.062217
F  7.752958 -0.507311 0.112656
F  7.630597 0.554377 -1.882795
O  -3.569628 -2.432103 -0.331341
O  3.663701 -2.345065 -0.085827
N  -2.618052 -0.445223 0.484113
N  2.58163 -0.298449 0.282399
C  -1.203183 -2.429925 0.202729
C  1.257881 -2.373435 0.217553
C  -3.719684 0.43458 0.420134
C  3.662673 0.602489 0.177502
C  0.011333 -1.702534 0.123122
C  -6.029621 1.01619 -0.147116
C  6.018786 1.175367 -0.165869
C  -2.5612 -1.787656 0.083842
C  2.598904 -1.688721 0.119083
C  -4.984538 0.071825 -0.116734
C  5.0014 0.202376 -0.078338
C  -1.166051 -3.840101 0.349522
C  1.276505 -3.783012 0.375699
C  -3.571316 1.762217 0.912208
C  3.41187 1.995938 0.336171
C  0.070694 -4.510569 0.43821
C  -5.860417 2.330165 0.347019
C  5.747581 2.552218 -0.004247
C  -4.611904 2.702014 0.885193
C  4.423099 2.962643 0.253252
C  -7.350493 0.635695 -0.758709
C  7.41994 0.728972 -0.484778
H  -0.024461 -0.627205 -0.096952
H  -5.123727 -0.946958 -0.483463
H  5.212837 -0.862904 -0.192714
H  -1.782832 -0.052047 0.928336
H  1.689057 0.141079 0.523472
H  -2.115132 -4.384806 0.37506
H  2.249547 -4.281723 0.426678
H  0.095238 -5.598752 0.552329
H  -6.685545 3.047031 0.325296
H  6.551215 3.290135 -0.066505
H  -4.4501 3.708557 1.279012
H  4.181125 4.020178 0.385335
