program: Gaussian 09
title: 000294930
version: EM64L-G09RevD.01
frameworkgroup: C1[X(C21H24N2O6)]
method: RPBEPBE
basis: SDD
operation: Freq
keyword: #p
keyword: freq=noraman
keyword: PBEPBE/SDD
title: #p freq=noraman PBEPBE/SDD
converged: YES YES NO NO
title: Mulliken charges:
elementType: O O O O O O N N C C C C C C C C C C C C C C C C C C C C C H H H H H H H H H H H H H H H H H H H H H H H H
charge: -0.277183 -0.269203 -0.216665 -0.282445 -0.434197 -0.335299 -0.361880 -0.362709 -0.174304 -0.579464 0.476365 -0.227295 0.258571 0.239087 -0.376469 -0.396348 -0.728480 -0.388642 -0.370098 0.279845 0.331720 -0.478897 0.474761 -0.506032 -0.390416 -0.366254 -0.224512 -0.227150 -0.232233 0.294106 0.227933 0.235100 0.361143 0.265771 0.237896 0.282286 0.243695 0.240985 0.225496 0.334407 0.216952 0.253798 0.239777 0.223907 0.248291 0.241368 0.231935 0.233018 0.267556 0.352282 0.228067 0.229542 0.230518
chargesum: 0.00000
title: Mulliken charges with hydrogens summed into heavy atoms:
elementType: O O O O O O N N C C C C C C C C C C C C C C C C C C C C C
charge: -0.277183 -0.269203 -0.216665 -0.282445 -0.081914 -0.335299 -0.000736 -0.028302 0.119802 -0.116432 0.476365 0.038475 0.258571 0.239087 -0.138573 -0.114062 -0.018305 -0.171691 -0.116301 0.279845 0.331720 -0.015214 0.474761 0.215563 -0.157399 -0.098698 0.003554 0.002392 -0.001715
polarizability: 3.15909959e+02 -1.53097331e+00 2.60617771e+02 -5.72130352e+00 3.18361259e+01 1.94691725e+02
1716.lowfreq: -1.8534 -0.0004 -0.0003 0.0006 1.5930 5.3857 11.1037 17.2025 20.5884
frequency: 10.8801 17.1524 20.3165 23.5759 28.8788 36.6980 43.0048 45.9677 46.9133 63.4105 69.3754 97.8515 101.3053 110.6448 135.8556 144.5980 152.3050 165.3927 180.1958 209.4387 217.9549 230.2685 245.4708 274.9037 301.3313 302.8558 316.8243 327.8749 349.2571 353.0632 371.1876 401.5460 404.4377 406.3295 417.9732 433.3748 444.6824 486.4081 505.6404 531.0410 554.3474 562.5289 592.3865 603.4955 617.6764 635.9070 638.1807 646.2711 661.5278 697.4916 703.4999 705.5296 713.4671 751.8756 759.0399 762.6517 804.2800 809.7643 815.6454 826.2376 848.1648 857.5533 859.9064 885.2688 915.0656 920.9107 935.6627 938.1212 952.2037 972.6133 975.7637 982.4030 989.9878 1001.3158 1002.2071 1004.4723 1010.0685 1027.3238 1048.0235 1084.0643 1091.5347 1108.6351 1114.2910 1130.6213 1135.9449 1144.5913 1149.1933 1155.2132 1173.8153 1184.8535 1189.0162 1204.5869 1207.6732 1220.3453 1221.9774 1226.0953 1239.3309 1246.5368 1251.1239 1314.5800 1323.2966 1330.2076 1335.3096 1341.4190 1348.1794 1352.6735 1386.0156 1392.1030 1393.4261 1421.7216 1428.7800 1442.6763 1452.0885 1458.9803 1461.4649 1461.7060 1465.7834 1472.6367 1482.9715 1485.3043 1496.5354 1507.8022 1594.6411 1596.3125 1615.0175 1619.5163 1626.6124 1634.7520 1657.8737 2998.7477 3004.3517 3009.2927 3019.6660 3027.0956 3035.2383 3078.0090 3100.6939 3105.9696 3106.6424 3109.7435 3110.0190 3120.4257 3128.5163 3128.6608 3139.4371 3140.2831 3148.4651 3151.3108 3165.4748 3169.8200 3500.6497 3562.4614 3582.1433
redmass: 5.5411 5.9137 5.4955 5.2856 4.6114 5.5959 5.0634 5.3610 6.5403 4.0863 6.8434 3.2142 1.4129 4.5064 3.7883 4.7180 5.4272 5.7517 4.3331 1.3193 4.6169 3.1043 4.5614 4.8349 4.8779 4.6879 3.9823 4.2695 1.1597 2.5665 3.0049 4.1104 2.8372 2.8710 3.0832 5.2415 3.8511 3.9151 4.2596 3.2677 3.6039 1.2173 4.3580 2.5058 6.2773 5.0638 4.7997 1.7333 4.6220 6.6384 4.4442 1.9850 4.2477 5.1944 2.3669 4.2227 3.6878 1.6851 3.5106 3.4350 1.6436 1.9851 2.0121 2.7651 2.6443 2.5524 1.4963 1.8006 3.0449 1.8168 1.3624 1.4260 5.2942 1.3666 3.2214 3.3034 2.4970 2.2099 1.7875 2.5237 1.5198 1.8929 1.2679 3.4709 2.0780 1.4085 1.4291 2.8686 1.0543 1.1460 1.1192 2.0859 1.8508 2.0354 2.5103 1.5193 1.1608 2.0008 2.0620 1.4178 1.3596 1.2571 1.3137 1.4371 1.4505 1.3021 7.9539 5.3630 1.2222 1.1775 2.7368 2.1816 1.0498 1.1419 1.1009 1.0942 1.0544 1.4483 1.2587 2.1665 1.9364 2.5790 6.0982 6.1533 6.1320 7.7148 6.3558 7.1442 9.9324 1.0357 1.0298 1.0663 1.0772 1.0853 1.0588 1.1015 1.1008 1.0995 1.1045 1.0880 1.1069 1.0868 1.0873 1.0909 1.0957 1.0919 1.1050 1.0964 1.1016 1.0948 1.0788 1.0777 1.0660
irintensity: 0.1693 0.2907 1.6706 4.1184 0.0015 0.3851 0.4672 0.2131 0.7675 0.9608 6.6157 7.5321 3.7980 7.8754 0.4331 1.7003 2.2635 1.7036 2.5659 0.1437 1.7854 1.1421 17.6838 14.1519 22.8278 7.2161 9.0444 8.4593 116.8344 42.5049 6.9303 6.3773 0.4021 6.0030 1.6377 8.8963 2.1792 4.5892 9.4951 41.9167 27.0364 89.8430 13.3917 7.5459 1.0458 14.6722 8.7704 97.9253 8.2294 10.5174 17.1472 62.4247 5.5294 18.4840 57.5717 1.3931 17.2664 24.7154 10.2367 11.2019 38.8989 15.2587 13.6635 8.8282 22.9798 2.7141 1.6535 5.2349 15.1330 3.6040 8.7778 2.2986 6.9585 2.2929 82.1843 132.6293 38.2221 3.2799 58.6398 7.0696 5.7205 167.5225 1.2482 181.1259 70.9851 137.3252 3.5384 12.9424 0.0260 5.2263 6.6870 1.5302 179.6078 143.1055 17.9872 2.0309 11.0660 48.1759 18.1506 38.0772 17.7465 2.6538 8.4797 12.6087 21.6019 9.3429 0.5174 18.9846 31.7298 14.8515 9.8303 10.3586 13.5842 51.4749 1.8625 28.6456 16.2856 237.1181 63.7310 44.9298 402.1048 46.5648 2.8708 7.5395 2.4868 42.4707 90.8057 369.4763 141.5148 20.3371 37.4064 19.3611 11.4364 6.8138 30.9935 14.3620 14.4351 20.9933 25.7943 18.0618 5.9979 5.5317 1.0731 2.5701 19.1959 15.8151 15.2409 28.2298 22.9027 4.0342 69.4446 49.2164 37.2704
temp: 298.150 k
press: 1.00000 atm
elementType: 8 8 8 8 8 8 7 7 6 6 6 6 6 6 6 6 6 6 6 6 6 6 6 6 6 6 6 6 6 1 1 1 1 1 1 1 1 1 1 1 1 1 1 1 1 1 1 1 1 1 1 1 1
symmnumber: 1
zpe: 1100791.5 jmol-1
zpe.correction: 0.419269 hartree
zpe.thermalcorrener: 0.448407 hartree
zpe.thermalcorrenthalpy: 0.449351 hartree
zpe.thermalcorrgfe: 0.353362 hartree
zpe.sumelectzpe: -1373.377803 hartree
zpe.sumelectthermal: -1373.348666 hartree
zpe.sumelectthermalent: -1373.347721 hartree
zpe.sumelectthermalfe: -1373.443710 hartree
dipole: 0.1449 1.8093 -0.7173
dipole: 1.9517
quadrupole: -126.0841 -173.9670 -167.8081
quadrupole: 18.0399 -0.8078 1.5266
quadrupole: 29.8689 -18.0139 -11.8551 18.0399 -0.8078 1.5266
hfenergy: -1373.7970726 hartree
pointgroup: C01 [X(C21H24N2O6)]
dipole: -0.0873803 0.6970059 0.3100428 debye
polarizability: 315.7975394|4.1259228|263.3230921|-2.9727729|-29.1719806|192.0988244 unknown
InChI: InChI=1S/C21H24N2O6/c1-14(22-21(27)29-13-16-6-4-3-5-7-16)19(25)23-18(20(26)28-2)12-15-8-10-17(24)11-9-15/h3-11,14,18,22-24H,12-13H2,1-2H3
charge 0 multiplicity 1
53 atoms
O  -5.136633 -1.325203 0.438154
O  -1.405313 -3.886013 0.102667
O  -3.920009 -1.330353 -1.548115
O  2.946039 -1.333093 1.144076
O  -2.448747 4.942848 -0.957211
O  1.266383 -0.18416 -0.061398
N  -1.500827 -1.563639 -0.096046
N  1.539583 -2.506199 -0.202558
C  -2.744543 -1.424087 0.655248
C  -2.707081 -0.208779 1.639991
C  -2.646813 1.155248 0.963616
C  0.408552 -2.727235 -1.130092
C  -0.923478 -2.793851 -0.327438
C  -3.950173 -1.349379 -0.301867
C  -3.83628 1.88805 0.720069
C  -1.411014 1.727457 0.55329
C  0.622521 -4.017303 -1.933202
C  -3.805127 3.148132 0.084549
C  -1.364385 2.982672 -0.085553
C  -2.563257 3.692509 -0.321415
C  1.863285 -1.25618 0.257586
C  3.472773 -0.018094 1.651241
C  4.573816 0.5206 0.764149
C  -6.384941 -1.293207 -0.362755
C  5.933259 0.252546 1.0646
C  4.258244 1.300691 -0.37914
C  6.963538 0.751183 0.236372
C  5.28714 1.798215 -1.208427
C  6.641639 1.525627 -0.902471
H  -2.86869 -2.352568 1.245439
H  -1.82713 -0.358609 2.292562
H  -3.609964 -0.278398 2.270698
H  -1.035572 -0.721995 -0.450624
H  0.373524 -1.85271 -1.805347
H  -4.798593 1.470208 1.039092
H  -0.469423 1.194564 0.733719
H  0.566394 -4.897732 -1.269488
H  -0.174045 -4.127791 -2.687681
H  1.597994 -3.995645 -2.449451
H  2.051166 -3.31008 0.165135
H  -4.737808 3.701504 -0.088369
H  -0.414936 3.423332 -0.403155
H  2.621584 0.681276 1.717925
H  3.842338 -0.273706 2.656576
H  -6.444436 -2.186734 -1.006265
H  -6.408599 -0.389946 -0.995593
H  -7.195671 -1.284107 0.379073
H  6.183784 -0.34912 1.947127
H  3.206615 1.499705 -0.615142
H  -3.33919 5.354263 -1.086077
H  8.011221 0.540387 0.478224
H  5.035091 2.399991 -2.0887
H  7.439493 1.915406 -1.5447
