program: Gaussian 09
title: 000294888
version: EM64L-G09RevD.01
frameworkgroup: C1[X(C13H18N2O2)]
method: RPBEPBE
basis: SDD
operation: Freq
keyword: #p
keyword: freq=noraman
keyword: PBEPBE/SDD
title: #p freq=noraman PBEPBE/SDD
converged: YES YES NO NO
title: Mulliken charges:
elementType: O O N N C C C C C C C C C C C C C H H H H H H H H H H H H H H H H H H
charge: -0.260126 -0.333639 -0.399635 -0.622576 -0.517957 -0.017714 -0.154055 -0.713288 -0.719162 0.201873 0.210026 0.264341 -0.348587 -0.347574 -0.221389 -0.239524 -0.225594 0.209403 0.254635 0.201460 0.284353 0.220709 0.215056 0.210295 0.218216 0.200321 0.228793 0.313205 0.321991 0.376950 0.276786 0.211359 0.234297 0.231985 0.234767
chargesum: 0.00000
title: Mulliken charges with hydrogens summed into heavy atoms:
elementType: O O N N C C C C C C C C C C C C C
charge: -0.260126 -0.333639 -0.086429 0.076364 -0.053919 0.183745 0.130298 -0.067228 -0.071832 0.201873 0.210026 0.264341 -0.071802 -0.136215 0.012908 -0.007539 0.009173
polarizability: 2.13248217e+02 1.55450843e+01 1.25853888e+02 8.17326695e+00 -1.30446735e+01 1.44079844e+02
1716.lowfreq: -8.4921 -2.0068 -0.0004 -0.0003 -0.0002 10.3190 13.9554 28.6561 37.0056
frequency: 12.4065 28.4073 36.9807 66.2001 77.1124 86.4163 119.7205 160.4826 177.3526 221.6519 231.6758 256.2232 268.7952 274.4820 295.4430 359.1149 371.6855 378.0987 401.1277 431.2092 445.3561 495.2289 528.6582 546.3337 582.4183 613.5200 615.5070 660.9315 685.4376 700.7892 712.5011 781.8223 788.6472 796.3989 836.5707 847.9727 853.1878 874.5356 915.5914 934.5514 955.8349 971.0346 985.0850 989.3448 1006.7351 1007.3386 1025.6083 1047.5656 1084.8236 1103.3393 1119.1786 1138.9191 1153.5054 1174.3577 1193.4944 1196.6549 1219.5785 1259.9352 1281.3662 1309.7734 1315.8915 1324.1348 1334.0398 1344.9157 1363.3520 1378.8002 1385.2619 1397.4996 1431.7881 1456.1017 1467.0777 1472.5066 1475.6296 1485.8712 1489.8584 1499.9160 1540.5024 1592.0534 1610.8349 1612.0692 1645.7655 2958.5579 2966.9538 2972.6117 2977.8050 3007.1732 3054.9378 3058.7676 3064.0270 3073.6030 3074.4193 3118.7973 3133.7159 3146.9633 3160.5587 3171.5293 3336.1143 3553.6894 3607.8953
redmass: 2.9478 3.8268 5.7307 5.3909 4.3525 4.6201 3.3512 4.7275 4.8298 1.6622 1.8216 1.1178 3.6879 6.3045 3.2916 2.9761 2.2404 2.6785 2.7923 3.9179 3.0170 3.9987 3.1219 1.2501 2.4936 2.3976 2.6192 5.1119 4.6819 1.5321 3.8091 1.3019 3.1656 1.8719 2.3068 2.9589 1.2658 4.0144 1.2018 1.4331 1.5058 1.8908 1.4324 5.2184 2.2656 1.4581 2.2537 1.9714 1.5673 1.8627 2.2447 2.0991 2.8100 1.0598 1.1389 1.9256 1.3484 1.3610 1.5235 1.7670 1.4251 1.5095 1.6368 1.9326 1.4410 1.2191 8.8475 1.2211 2.2508 1.4495 1.0508 1.4000 1.0711 1.0865 1.0784 2.1387 3.9995 3.0625 3.0129 2.4740 5.8059 1.0789 1.0374 1.0411 1.0672 1.0816 1.0946 1.0970 1.0990 1.0994 1.0990 1.0874 1.0869 1.0922 1.0957 1.1005 1.0604 1.0772 1.0926
irintensity: 0.2855 0.2721 1.3438 4.5051 0.6384 3.4398 1.8091 1.8724 16.8630 0.2080 1.4084 0.6733 13.2891 9.1109 1.7975 3.0348 0.5928 0.5662 0.3439 0.3877 6.9135 0.7449 14.7087 77.5102 20.8701 68.6471 73.6637 5.0317 12.8089 101.9463 49.8322 129.2109 2.3150 48.6204 8.3941 5.5802 0.6121 4.8576 2.0114 2.6820 1.2101 2.3253 1.3264 0.5277 0.0454 1.4658 6.4472 1.8983 15.5087 2.4148 4.0908 1.2709 11.1139 0.8815 5.2156 7.2439 5.0699 9.0444 58.7998 38.9326 1.6357 17.3792 9.5436 40.5265 4.7507 16.9276 2.5691 13.5226 10.4211 150.2195 4.8425 49.5776 1.9090 39.6496 15.8243 129.6229 204.0875 47.8381 24.2230 20.4906 315.8472 22.7588 32.0251 37.2432 16.8174 10.6811 4.2506 52.0442 23.3530 39.0971 85.5911 11.7954 1.2239 21.3561 14.4714 19.7311 181.2413 16.8260 60.0064
temp: 298.150 k
press: 1.00000 atm
elementType: 8 8 7 7 6 6 6 6 6 6 6 6 6 6 6 6 6 1 1 1 1 1 1 1 1 1 1 1 1 1 1 1 1 1 1
symmnumber: 1
zpe: 764150.6 jmol-1
zpe.correction: 0.291050 hartree
zpe.thermalcorrener: 0.308355 hartree
zpe.thermalcorrenthalpy: 0.309300 hartree
zpe.thermalcorrgfe: 0.243677 hartree
zpe.sumelectzpe: -764.895160 hartree
zpe.sumelectthermal: -764.877854 hartree
zpe.sumelectthermalent: -764.876910 hartree
zpe.sumelectthermalfe: -764.942532 hartree
dipole: 3.0858 2.6985 -0.3781
dipole: 4.1167
quadrupole: -97.9332 -102.0150 -103.0391
quadrupole: -5.4996 -8.0798 -6.3528
quadrupole: 3.0626 -1.0192 -2.0434 -5.4996 -8.0798 -6.3528
hfenergy: -765.1862095 hartree
pointgroup: C01 [X(C13H18N2O2)]
dipole: 1.322764 0.8731578 -0.3332393 debye
polarizability: 215.8659671|5.8808809|119.3004145|4.2040039|-9.6541666|148.0155681 unknown
InChI: InChI=1S/C13H18N2O2/c1-9(2)8-11(12(14)16)15-13(17)10-6-4-3-5-7-10/h3-7,9,11,15H,8,14H2,1-2H3
charge 0 multiplicity 1
35 atoms
O  -3.460413 -1.961028 -0.894396
O  0.10923 -0.881012 1.802786
N  -0.586748 -0.131877 -0.276466
N  -2.068032 -2.466259 0.906578
C  -2.826331 0.807345 -0.845368
C  -2.790099 2.315695 -0.466231
C  -2.03029 -0.153555 0.061474
C  -3.39697 2.580419 0.933634
C  -1.387469 2.961069 -0.585974
C  -2.593947 -1.614659 -0.037601
C  0.401464 -0.466021 0.622984
C  1.829732 -0.31391 0.178234
C  2.826237 -0.288889 1.187688
C  2.220839 -0.221497 -1.184272
C  4.186888 -0.150698 0.845184
C  3.584049 -0.090042 -1.526285
C  4.570071 -0.047736 -0.513015
H  -2.48742 0.676282 -1.89444
H  -3.874809 0.458741 -0.841388
H  -3.446172 2.818853 -1.208282
H  -2.110757 0.145464 1.124599
H  -4.40106 2.126917 1.029241
H  -3.49554 3.666309 1.116705
H  -2.758832 2.170419 1.739343
H  -1.44968 4.053108 -0.423016
H  -0.949201 2.799971 -1.590392
H  -0.686777 2.552024 0.164514
H  -0.336956 0.234632 -1.196043
H  -2.363607 -3.442657 0.905112
H  -1.340327 -2.126212 1.554505
H  2.505774 -0.38529 2.229955
H  1.482033 -0.289113 -1.992496
H  4.947638 -0.126477 1.632851
H  3.877638 -0.030129 -2.579849
H  5.627344 0.055411 -0.780873
