program: Gaussian 09
title: 000294887
version: EM64L-G09RevD.01
frameworkgroup: C1[X(C13H17NO3)]
method: RPBEPBE
basis: SDD
operation: Freq
keyword: #p
keyword: freq=noraman
keyword: PBEPBE/SDD
title: #p freq=noraman PBEPBE/SDD
converged: YES YES NO NO
title: Mulliken charges:
elementType: O O O N C C C C C C C C C C C C C H H H H H H H H H H H H H H H H H
charge: -0.440773 -0.214523 -0.290249 -0.403061 -0.008302 -0.430302 -0.118822 -0.728973 -0.711549 0.149736 0.174699 0.271635 -0.363426 -0.364973 -0.222567 -0.237070 -0.226947 0.190683 0.207266 0.229558 0.291462 0.213219 0.248559 0.212230 0.253541 0.201598 0.208090 0.326252 0.274861 0.224537 0.388128 0.232866 0.229745 0.232875
chargesum: 0.00000
title: Mulliken charges with hydrogens summed into heavy atoms:
elementType: O O O N C C C C C C C C C C C C C
charge: -0.052645 -0.214523 -0.290249 -0.076809 0.182380 0.006522 0.172640 -0.054966 -0.048319 0.149736 0.174699 0.271635 -0.088565 -0.140436 0.010298 -0.007325 0.005928
polarizability: 2.05738187e+02 -3.41947848e+00 1.53725559e+02 1.13081814e+01 1.92621531e+01 1.08850357e+02
1716.lowfreq: -11.0166 -5.6371 -4.9960 -0.0006 -0.0005 -0.0001 24.9302 31.2634 32.9236
frequency: 24.3563 31.1606 32.8974 44.4172 63.9365 89.9272 106.0754 132.6514 168.1622 199.3678 226.6417 244.1167 261.6709 291.4861 312.5293 335.0398 364.6533 383.6633 402.3327 418.0128 466.2412 511.1463 549.7163 565.6780 590.8685 609.0064 614.6337 659.1189 681.6989 687.8235 704.0089 787.4194 793.9365 811.4369 846.0842 856.8946 877.3008 921.1676 937.1219 951.3283 968.2833 984.6705 989.4852 999.0162 1005.4396 1022.1683 1048.9163 1074.8850 1084.8634 1121.7385 1122.9350 1163.7360 1173.6574 1191.5621 1201.9105 1232.3011 1253.2607 1269.8744 1296.2509 1309.9753 1317.1292 1318.7406 1341.7583 1356.8684 1380.1041 1385.0741 1399.1231 1432.5472 1449.3748 1461.8686 1472.7450 1481.4039 1485.5430 1500.4115 1502.2171 1568.5525 1603.1767 1611.3364 1668.5265 2948.8892 2970.5031 2974.7647 2980.4889 3032.8996 3051.2817 3063.9640 3068.2564 3071.8744 3093.0402 3117.0340 3131.7658 3144.7119 3158.0247 3169.6842 3523.9205 3562.7247
redmass: 4.1089 4.3646 8.4781 3.2043 5.9096 4.3326 3.2691 4.3156 4.6685 3.1807 3.1408 1.3381 1.1063 4.5909 6.5118 2.7657 2.1874 2.4618 2.8144 4.6004 4.5348 2.9248 3.8042 1.4560 1.4059 2.7116 5.7712 6.0093 3.1956 4.7507 1.5237 3.0988 2.5124 5.5488 2.0263 1.2754 3.9363 1.2137 1.4422 1.5908 1.8499 1.4385 5.1582 2.2957 1.3450 2.6417 2.1840 2.4873 1.6707 1.7466 2.1860 2.8359 1.0604 1.1412 1.9894 1.3027 1.3272 1.8455 1.8890 1.4281 1.5392 1.3869 1.4489 1.3067 1.2181 8.8763 1.2109 2.2140 1.1178 1.0527 1.9173 1.0670 1.0622 1.8832 1.1208 6.2059 6.4872 6.0530 9.2011 1.0796 1.0370 1.0528 1.0457 1.0983 1.0863 1.0995 1.0993 1.0998 1.0985 1.0876 1.0870 1.0921 1.0957 1.1006 1.0642 1.0771
irintensity: 0.5595 0.2025 1.4177 1.4531 4.4761 4.3241 0.6209 1.2001 1.7673 2.4615 3.6290 2.2192 0.5815 2.6685 4.5903 0.9857 0.7221 3.1567 0.2490 2.2233 8.7124 11.0704 19.2689 12.6497 174.1393 57.7415 4.7023 20.9545 33.5552 18.9054 118.7156 12.8813 15.1882 1.8025 15.2088 0.7670 53.1220 3.4145 3.9609 1.6770 2.3449 1.0607 0.4603 2.4285 1.2131 6.2157 49.4512 114.0660 41.6974 29.0451 3.5582 27.1627 1.1372 9.4137 6.2510 3.8453 19.4400 39.1946 104.8277 0.9974 23.6121 1.5769 2.8377 3.3291 23.0882 1.8546 20.4231 3.6153 48.7808 8.3156 99.4221 25.7890 3.5787 195.7894 15.7967 97.0979 46.7647 5.0678 246.3599 21.8869 39.7360 41.8334 31.7460 13.9934 16.8355 28.9478 43.7258 38.3484 29.0745 8.2050 1.4505 21.0783 16.9473 20.5764 30.9631 23.6514
temp: 298.150 k
press: 1.00000 atm
elementType: 8 8 8 7 6 6 6 6 6 6 6 6 6 6 6 6 6 1 1 1 1 1 1 1 1 1 1 1 1 1 1 1 1 1
symmnumber: 1
zpe: 728950.4 jmol-1
zpe.correction: 0.277643 hartree
zpe.thermalcorrener: 0.295023 hartree
zpe.thermalcorrenthalpy: 0.295967 hartree
zpe.thermalcorrgfe: 0.230140 hartree
zpe.sumelectzpe: -784.753840 hartree
zpe.sumelectthermal: -784.736460 hartree
zpe.sumelectthermalent: -784.735516 hartree
zpe.sumelectthermalfe: -784.801342 hartree
dipole: 1.8450 1.8602 3.7225
dipole: 4.5521
quadrupole: -94.8861 -92.4066 -107.6009
quadrupole: 3.2390 -3.7312 4.1053
quadrupole: 3.4118 5.8913 -9.3030 3.2390 -3.7312 4.1053
hfenergy: -785.0314828 hartree
pointgroup: C01 [X(C13H17N1O3)]
dipole: -0.5955559 0.7397493 -1.518387 debye
polarizability: 205.443334|-4.1999306|151.0528954|8.8091063|-23.5763536|111.8178734 unknown
InChI: InChI=1S/C13H17NO3/c1-9(2)8-11(13(16)17)14-12(15)10-6-4-3-5-7-10/h3-7,9,11,14,16H,8H2,1-2H3
charge 0 multiplicity 1
34 atoms
O  1.838604 2.525819 -0.603924
O  3.600995 1.817956 0.733486
O  -0.335963 -0.950484 1.546427
N  0.427048 0.319908 -0.245035
C  2.499611 -2.260284 -0.683329
C  2.680373 -0.723521 -0.849185
C  1.843274 0.191135 0.10843
C  2.809183 -2.732988 0.758121
C  1.123163 -2.791429 -1.151352
C  2.52631 1.559661 0.155831
C  -0.58369 -0.189168 0.554279
C  -1.991649 0.183078 0.16835
C  -3.039831 -0.655044 0.626284
C  -2.308338 1.339248 -0.592886
C  -4.381119 -0.358733 0.307828
C  -3.6524 1.638092 -0.906405
C  -4.691163 0.786587 -0.463654
H  3.267815 -2.70238 -1.354734
H  2.456863 -0.431027 -1.895325
H  3.746943 -0.48652 -0.664939
H  1.881474 -0.231426 1.128229
H  3.778573 -2.338896 1.117992
H  2.01656 -2.412789 1.459497
H  2.856716 -3.836856 0.798497
H  0.322842 -2.500305 -0.45052
H  0.862673 -2.416645 -2.158989
H  1.138884 -3.896652 -1.194737
H  0.198643 0.909907 -1.045779
H  -2.776147 -1.524651 1.236902
H  -1.522755 2.036124 -0.910749
H  2.339962 3.384755 -0.571835
H  -5.183836 -1.014929 0.661387
H  -3.889866 2.537455 -1.485148
H  -5.733353 1.019404 -0.708913
