program: Gaussian 09
title: 000294885
version: EM64L-G09RevD.01
frameworkgroup: C1[X(C12H14N2O4)]
method: RPBEPBE
basis: SDD
operation: Freq
keyword: #p
keyword: freq=noraman
keyword: PBEPBE/SDD
title: #p freq=noraman PBEPBE/SDD
converged: YES YES NO NO
title: Mulliken charges:
elementType: O O O O N N C C C C C C C C C C C C H H H H H H H H H H H H H H
charge: -0.273456 -0.328124 -0.258493 -0.243090 -0.375116 -0.346278 -0.513914 0.277696 0.254050 0.218828 -0.455290 -0.350811 -0.352967 -0.219217 -0.238959 -0.225464 0.266667 -0.499881 0.248648 0.261212 0.317773 0.282894 0.260611 0.369287 0.276518 0.215445 0.235840 0.233776 0.236163 0.243106 0.245918 0.236628
chargesum: 0.00000
title: Mulliken charges with hydrogens summed into heavy atoms:
elementType: O O O O N N C C C C C C C C C C C C
charge: -0.273456 -0.328124 -0.258493 -0.243090 -0.057343 0.023010 -0.004054 0.277696 0.254050 0.218828 0.088215 -0.074293 -0.137522 0.016624 -0.005183 0.010699 0.266667 0.225771
polarizability: 1.92098854e+02 -3.22009473e+01 1.31630188e+02 2.94753585e+00 7.93125585e+00 1.38462323e+02
1716.lowfreq: -6.2479 -3.4449 -0.0011 -0.0007 -0.0003 4.8572 14.0530 19.2056 28.8728
frequency: 13.6232 19.0525 28.7037 36.0241 58.8235 65.5690 90.4961 121.2411 134.9126 168.8026 170.7976 216.6726 247.9829 272.1986 286.7702 312.1860 343.4369 388.6615 401.4045 432.9341 471.5060 505.3235 537.5178 543.8950 610.3133 614.6167 648.0633 653.5290 686.2289 702.3744 741.7167 772.6151 788.1718 800.2358 807.5974 854.8468 866.1763 934.7862 967.4813 974.9779 985.0911 988.6189 999.2978 1006.9857 1024.7787 1034.4570 1085.0435 1112.7964 1115.9258 1146.8040 1149.5756 1174.7090 1192.9556 1195.4754 1231.0046 1252.3792 1276.2694 1290.8068 1318.2081 1331.5800 1334.1775 1384.6649 1420.3638 1430.2415 1434.2717 1439.9915 1452.5683 1463.4374 1470.4172 1503.3818 1528.5653 1558.7977 1598.2155 1611.3666 1637.2863 1641.6459 3004.0620 3005.4516 3022.5337 3063.0034 3109.1681 3118.9761 3118.9928 3134.6621 3147.4532 3149.0862 3160.5950 3172.0085 3348.2463 3573.7876
redmass: 5.6916 4.0687 4.9091 4.4105 6.5938 8.6608 1.0781 5.7239 4.8385 3.9718 3.8054 4.8658 2.9233 5.1395 5.7178 4.9622 3.7366 4.1376 2.8905 4.7798 4.5285 3.5147 2.8844 1.3530 4.4925 6.3064 5.0528 5.3216 4.8998 1.5534 5.4152 2.9760 2.8258 3.2336 1.5740 1.2542 2.8288 1.4359 7.6104 2.5885 1.4213 5.3561 4.4212 1.3481 2.5708 2.2473 1.5837 1.5908 2.4352 2.8745 1.5136 1.0585 1.1598 5.7789 1.4914 1.1356 2.0177 2.0100 1.3482 1.2876 1.3180 8.7450 1.1632 1.8583 1.0972 1.2809 1.0508 1.0504 1.9507 2.2797 2.0003 4.2426 6.2185 6.0073 6.1021 8.6548 1.0578 1.0308 1.0630 1.1009 1.1047 1.0882 1.1006 1.0870 1.0921 1.1052 1.0957 1.1006 1.0834 1.0780
irintensity: 0.2230 0.7838 0.9203 0.6771 3.3293 6.2167 0.3892 11.1239 3.4802 7.9095 6.6171 3.9003 12.0306 8.1409 8.2758 10.4113 6.0709 2.8725 1.0712 11.5614 11.3161 25.3500 8.3740 95.0001 5.3299 1.1415 14.5861 10.1301 8.6784 105.6110 12.5096 29.3673 8.3572 8.4805 134.2011 1.1027 26.5330 3.3098 41.2193 3.1224 1.3836 0.3568 7.5027 1.5293 9.5341 3.9934 14.6406 9.9696 15.0677 2.2759 18.1566 0.2152 0.3366 188.2975 45.2575 19.2917 9.8406 103.5237 1.8297 5.0082 11.4713 1.8119 24.0547 3.0574 14.7670 29.9306 9.1850 7.1730 88.0150 130.9793 278.3760 34.2326 15.8714 6.2316 272.2643 256.8779 35.7608 23.7525 18.0351 3.6438 19.5992 8.5577 7.9624 1.2958 19.9633 13.4149 14.0202 18.3499 229.4773 20.5464
temp: 298.150 k
press: 1.00000 atm
elementType: 8 8 8 8 7 7 6 6 6 6 6 6 6 6 6 6 6 6 1 1 1 1 1 1 1 1 1 1 1 1 1 1
symmnumber: 1
zpe: 653414.9 jmol-1
zpe.correction: 0.248873 hartree
zpe.thermalcorrener: 0.266699 hartree
zpe.thermalcorrenthalpy: 0.267643 hartree
zpe.thermalcorrgfe: 0.198837 hartree
zpe.sumelectzpe: -874.774898 hartree
zpe.sumelectthermal: -874.757072 hartree
zpe.sumelectthermalent: -874.756128 hartree
zpe.sumelectthermalfe: -874.824934 hartree
dipole: -5.8827 0.0696 -1.0344
dipole: 5.9734
quadrupole: -109.4971 -104.2809 -102.9883
quadrupole: -7.2107 9.4659 -2.6142
quadrupole: -3.9083 1.3079 2.6005 -7.2107 9.4659 -2.6142
hfenergy: -875.023771 hartree
pointgroup: C01 [X(C12H14N2O4)]
dipole: -2.2658359 0.3829377 -0.4923205 debye
polarizability: 175.6814918|-37.7694719|152.8764963|18.0731771|2.9869683|133.6333765 unknown
InChI: InChI=1S/C12H14N2O4/c1-18-11(16)8-13-10(15)7-14-12(17)9-5-3-2-4-6-9/h2-6,13-14H,7-8H2,1H3
charge 0 multiplicity 1
32 atoms
O  2.657337 -2.931722 -0.262031
O  -0.283256 -0.283677 2.056256
O  2.003807 0.962014 -0.627666
O  4.203432 1.7018 -0.416463
N  -0.542878 -1.911011 0.431333
N  2.318824 -1.073748 1.123308
C  0.53517 -2.748683 0.98803
C  -1.992782 0.083113 0.363073
C  1.940961 -2.271278 0.550341
C  -0.884646 -0.702378 1.004898
C  3.530589 -0.384507 0.702351
C  -2.645717 1.06101 1.15653
C  -2.386184 -0.088173 -0.991145
C  -3.692608 1.835754 0.616091
C  -3.429798 0.693343 -1.532977
C  -4.090616 1.651697 -0.729417
C  3.310053 0.864841 -0.15785
C  1.713424 2.144515 -1.476635
H  0.407001 -3.782331 0.633493
H  0.45746 -2.722604 2.090083
H  -1.020819 -2.233765 -0.409668
H  4.131264 -1.099761 0.10832
H  4.144534 -0.073878 1.56703
H  1.615012 -0.586664 1.702492
H  -2.310235 1.196047 2.189771
H  -1.865215 -0.796919 -1.646788
H  -4.195857 2.582644 1.239404
H  -3.721755 0.560708 -2.580346
H  -4.901995 2.254937 -1.151178
H  2.28528 2.082322 -2.417721
H  1.986032 3.071842 -0.946002
H  0.631482 2.094414 -1.662519
