program: Gaussian 09
title: 000294873
version: EM64L-G09RevD.01
frameworkgroup: C1[X(C10H16N2)]
method: RPBEPBE
basis: SDD
operation: Freq
keyword: #pfreq=noraman
keyword: PBEPBE/SDD
title: #p freq=noraman PBEPBE/SDD
converged: YES YES NO NO
title: Mulliken charges:
elementType: N N C C C C C C C C C C H H H H H H H H H H H H H H H H
charge: -0.548043 -0.548587 0.341643 0.341709 0.327124 0.328731 -0.638947 -0.583416 -0.577698 -0.575190 -0.831546 -0.829990 0.233764 0.230437 0.214692 0.227788 0.213840 0.227576 0.226627 0.231640 0.224085 0.223755 0.225434 0.231801 0.276370 0.265277 0.275767 0.265357
chargesum: 0.00000
title: Mulliken charges with hydrogens summed into heavy atoms:
elementType: N N C C C C C C C C C C
charge: -0.006397 -0.007463 0.341643 0.341709 0.327124 0.328731 -0.405182 -0.352978 -0.135218 -0.133774 -0.149194 -0.148999
polarizability: 1.65058899e+02 -3.41624186e-02 1.28309209e+02 4.03852673e+00 -1.11578212e-02 7.93766723e+01
1716.lowfreq: -15.4144 -7.1953 -1.4341 -0.0003 -0.0002 0.0005 55.3645 57.8373 81.6980
frequency: 55.2929 57.8176 81.6957 106.3235 128.8589 142.7784 209.4888 210.1318 216.9560 233.7084 290.5926 308.9487 319.0486 357.5524 400.4743 427.6831 468.1837 501.4895 542.9092 614.0160 622.7950 628.1894 717.4780 743.5498 762.1648 789.2557 855.1748 867.6186 888.0020 913.8772 980.2514 1017.8555 1033.0928 1035.8459 1052.4101 1066.1827 1087.7392 1105.9412 1126.7861 1193.0215 1201.0568 1267.9367 1276.4619 1324.9629 1325.7208 1327.4838 1329.4466 1376.0789 1390.4629 1395.2257 1397.6147 1453.5461 1454.5752 1474.8305 1475.0109 1477.6738 1479.8375 1500.6022 1574.0659 1618.5310 1643.9320 1644.1387 2965.7517 2966.3889 2986.1738 2986.6387 3040.0418 3040.5502 3043.2935 3044.0571 3078.5646 3078.6722 3091.2589 3102.0714 3453.6717 3455.0665 3580.9006 3582.4884
redmass: 2.3970 2.3351 3.3833 1.5961 1.1124 1.5561 1.4495 3.0752 2.8051 1.3298 2.4446 2.2214 1.5820 2.9979 3.9829 3.3461 2.4357 3.6509 2.1967 3.3173 1.6097 1.7384 5.7077 3.0910 5.0967 2.7256 1.3287 1.3643 1.2816 1.5322 1.4394 1.6950 1.5832 1.8193 2.6326 3.7663 4.5776 1.3705 1.2360 4.2551 1.4390 6.4292 1.2684 1.2881 1.2621 1.2561 1.3484 3.3822 2.1869 1.2507 1.6461 1.1214 1.0792 1.0941 1.1147 1.0662 1.0912 2.5267 6.3549 6.4977 1.0862 1.0891 1.0396 1.0396 1.0601 1.0602 1.1030 1.1030 1.0943 1.0938 1.0984 1.0986 1.0899 1.0908 1.0447 1.0448 1.0973 1.0973
irintensity: 1.8035 0.3857 0.1195 0.2121 0.2860 8.8070 20.2770 1.4931 7.6129 53.7817 4.1222 10.2722 11.2278 11.3162 1.2094 2.4275 16.4327 5.1841 79.3674 20.7130 161.4229 472.0827 5.6252 0.1079 57.9565 41.0615 0.0128 4.7458 5.8458 13.9398 0.4446 6.9670 1.2091 7.0663 11.7108 8.0354 20.4564 0.3373 3.0093 0.0017 3.8263 1.6756 0.1186 5.4459 0.6131 0.2592 3.7353 0.4151 2.8483 12.1072 7.2284 3.4802 1.3094 22.9364 0.9691 44.6516 12.7596 16.8527 0.4386 1.4579 14.1421 41.9692 66.5639 18.4391 59.3501 33.2442 20.8791 31.4494 18.2051 28.8271 9.2199 26.6149 30.7689 20.2299 1.7395 1.7397 0.6338 0.6436
temp: 298.150 k
press: 1.00000 atm
elementType: 7 7 6 6 6 6 6 6 6 6 6 6 1 1 1 1 1 1 1 1 1 1 1 1 1 1 1 1
symmnumber: 1
zpe: 634415.4 jmol-1
zpe.correction: 0.241636 hartree
zpe.thermalcorrener: 0.255428 hartree
zpe.thermalcorrenthalpy: 0.256372 hartree
zpe.thermalcorrgfe: 0.201589 hartree
zpe.sumelectzpe: -499.233551 hartree
zpe.sumelectthermal: -499.219759 hartree
zpe.sumelectthermalent: -499.218815 hartree
zpe.sumelectthermalfe: -499.273598 hartree
dipole: 0.0024 2.3262 -0.0015
dipole: 2.3262
quadrupole: -80.4268 -73.4718 -71.7490
quadrupole: -0.0210 -1.0608 0.0178
quadrupole: -5.2110 1.7441 3.4669 -0.0210 -1.0608 0.0178
hfenergy: -499.4751867 hartree
pointgroup: C01 [X(C10H16N2)]
dipole: -0.0096134 -0.9146268 -0.0308218 debye
polarizability: 165.1745246|-0.3018431|128.2574161|-2.4707072|1.6530893|79.3128394 unknown
InChI: InChI=1S/C10H16N2/c1-7-3-8(2)10(6-12)4-9(7)5-11/h3-4H,5-6,11-12H2,1-2H3
charge 0 multiplicity 1
28 atoms
N  3.464133 1.244628 0.829459
N  -3.48323 1.364977 -0.693103
C  1.211922 0.526626 -0.150811
C  -1.248765 0.53512 0.238408
C  1.198719 -0.899032 -0.201352
C  -1.260626 -0.890995 0.191755
C  -0.012611 1.204623 0.066955
C  -0.037008 -1.569638 -0.027945
C  2.504267 1.337687 -0.29798
C  -2.527275 1.356316 0.441103
C  2.467566 -1.71087 -0.412279
C  -2.543653 -1.692134 0.350843
H  -0.002984 2.303451 0.103884
H  -0.046558 -2.667451 -0.065344
H  3.048916 1.039106 -1.213977
H  2.241475 2.404165 -0.429637
H  -3.080832 0.999655 1.330638
H  -2.246003 2.405052 0.653103
H  3.029244 -1.838439 0.534654
H  2.23216 -2.72115 -0.789584
H  3.153004 -1.233064 -1.1361
H  -3.205018 -1.269111 1.129428
H  -3.125152 -1.719152 -0.592218
H  -2.32495 -2.737774 0.628556
H  3.972163 0.356093 0.876691
H  3.051909 1.489761 1.735904
H  -4.008696 0.493004 -0.80737
H  -3.063017 1.669044 -1.577683
