program: Gaussian 09
title: 000294891
version: EM64L-G09RevD.01
frameworkgroup: C1[X(C18H16N2O3)]
method: RPBEPBE
basis: SDD
operation: Freq
keyword: #p
keyword: freq=noraman
keyword: PBEPBE/SDD
title: #p freq=noraman PBEPBE/SDD
converged: YES YES NO NO
title: Mulliken charges:
elementType: O O O N N C C C C C C C C C C C C C C C C C C H H H H H H H H H H H H H H H H
charge: -0.403406 -0.231897 -0.310797 -0.428643 -0.404717 -0.506331 0.356582 -0.138741 0.107339 0.235275 -0.418727 -0.406924 -0.357715 0.133181 -0.255117 -0.219495 0.200171 0.270213 -0.359836 -0.349574 -0.234005 -0.223894 -0.226217 0.250505 0.207722 0.286442 0.322372 0.306285 0.322961 0.226676 0.227367 0.218331 0.220154 0.227367 0.272917 0.387362 0.231219 0.232509 0.233087
chargesum: 0.00000
title: Mulliken charges with hydrogens summed into heavy atoms:
elementType: O O O N N C C C C C C C C C C C C C C C C C C
charge: -0.016044 -0.231897 -0.310797 -0.122359 -0.081756 -0.048104 0.356582 0.147701 0.107339 0.235275 -0.096355 -0.180248 -0.130348 0.133181 -0.036786 0.000659 0.200171 0.270213 -0.132469 -0.076657 -0.002786 0.008614 0.006870
polarizability: 2.53032626e+02 7.58510772e+00 2.00592486e+02 2.43420147e+01 6.88256621e+00 1.89418067e+02
1716.lowfreq: -12.3191 -0.0007 -0.0005 0.0003 4.1224 5.1914 15.1501 29.4090 39.2914
frequency: 14.8869 29.3905 39.2829 44.5742 53.7053 72.8936 89.2534 96.8997 137.1356 152.9807 176.5098 203.0261 226.0653 236.7485 291.5296 305.3010 317.3830 381.4185 402.6605 412.5367 423.1773 454.8952 473.3920 518.2866 526.5215 546.9372 569.0868 576.8852 577.6424 597.6225 610.3740 615.1909 624.9727 659.8868 680.1012 688.6266 704.1816 747.1665 749.3802 759.2249 767.0078 793.0963 824.2489 838.1719 851.8954 856.8346 869.8902 890.0404 928.9071 938.2097 938.8536 968.0058 985.6007 989.9991 1005.4390 1009.2781 1011.2061 1023.0833 1039.4756 1068.9639 1082.7725 1096.9956 1106.6900 1137.7652 1154.1748 1166.6615 1174.0040 1190.6045 1214.7302 1231.9349 1243.1880 1258.8710 1278.3329 1298.5853 1309.8372 1317.2516 1318.5716 1343.3232 1359.8208 1385.5359 1391.8554 1421.3963 1433.3618 1461.5045 1462.2250 1474.6545 1480.8403 1499.7175 1564.0120 1570.1702 1586.2408 1601.6790 1612.0719 1632.1634 1655.2793 2964.8984 3011.5277 3040.6647 3120.5200 3124.4398 3128.3026 3133.3181 3142.3718 3146.5398 3159.4302 3161.1477 3170.4640 3199.2968 3511.7284 3536.5168 3615.1853
redmass: 5.7756 3.9971 5.1643 9.6481 5.8526 5.5357 5.8871 7.2482 4.8855 5.1756 3.9306 6.0434 4.2639 4.1304 5.0022 5.7973 5.0049 3.5621 2.8722 5.5465 2.8598 3.9217 3.8032 1.3086 3.6899 4.6164 1.4726 4.8198 3.0210 1.4574 3.1521 5.9502 4.3085 6.2878 3.6392 5.0592 1.5575 1.3463 4.6891 3.9268 5.0425 2.3561 4.7597 1.4439 1.4709 1.2501 5.0256 2.0995 1.3906 1.4986 3.7645 1.2985 1.4693 4.8573 1.3400 2.8796 2.6427 2.6168 2.6179 3.1141 1.6402 2.5668 1.7056 1.5534 2.4479 1.0831 1.0585 1.1330 1.3544 1.7699 1.5321 1.6397 2.0741 1.6144 1.8317 1.3544 1.4819 2.2147 1.7036 9.1925 5.0503 2.3127 2.2325 2.9738 1.3625 1.8483 2.9577 2.2076 5.8771 5.6622 5.9981 6.5155 6.0629 6.6167 8.6667 1.0598 1.0982 1.0847 1.0849 1.0864 1.0888 1.0877 1.0951 1.0924 1.0959 1.1001 1.1007 1.1010 1.0641 1.0768 1.0809
irintensity: 0.3685 0.6458 1.1594 0.5957 0.8818 0.8127 6.9759 5.7883 0.9854 5.4388 3.7919 0.4014 6.3684 13.1981 3.8217 6.7357 0.5649 15.8812 0.1738 7.0955 9.7934 9.6909 1.5255 72.1786 91.3988 4.9836 25.8770 3.5310 13.0940 181.8381 11.3169 2.9843 21.0333 3.5920 34.5471 11.6478 117.5242 108.7877 2.4079 7.2719 3.0674 18.8160 11.8667 13.4772 9.7111 2.3544 1.4996 24.1638 2.6703 5.0719 13.1933 0.0513 1.9847 1.3219 1.9312 8.7575 16.0040 11.1479 201.2163 18.3013 27.9136 41.7187 27.9304 10.7902 5.7414 0.2292 0.7067 8.4858 9.2528 7.9541 19.7164 3.1436 85.5387 9.6744 3.2164 1.5272 20.7713 186.0080 13.5823 1.4338 47.6356 5.4022 2.2376 6.7459 91.4869 48.3870 1.5040 204.2993 62.8750 53.0671 1.6734 50.0792 8.4955 3.2133 199.5417 27.2600 8.6952 19.8251 3.1669 5.9046 3.3359 2.9222 38.3655 22.1994 15.8600 34.0870 20.5922 27.1693 30.2597 28.4901 55.8203
temp: 298.150 k
press: 1.00000 atm
elementType: 8 8 8 7 7 6 6 6 6 6 6 6 6 6 6 6 6 6 6 6 6 6 6 1 1 1 1 1 1 1 1 1 1 1 1 1 1 1 1
symmnumber: 1
zpe: 795930.1 jmol-1
zpe.correction: 0.303154 hartree
zpe.thermalcorrener: 0.322945 hartree
zpe.thermalcorrenthalpy: 0.323889 hartree
zpe.thermalcorrgfe: 0.251940 hartree
zpe.sumelectzpe: -1029.110588 hartree
zpe.sumelectthermal: -1029.090797 hartree
zpe.sumelectthermalent: -1029.089853 hartree
zpe.sumelectthermalfe: -1029.161802 hartree
dipole: -0.6173 -0.6082 0.9813
dipole: 1.3092
quadrupole: -129.3588 -115.6309 -129.9732
quadrupole: 6.5282 -2.1766 3.9686
quadrupole: -4.3712 9.3567 -4.9855 6.5282 -2.1766 3.9686
hfenergy: -1029.4137419 hartree
pointgroup: C01 [X(C18H16N2O3)]
dipole: 0.3615102 -0.2548603 -0.2639064 debye
polarizability: 242.0025543|15.6667501|200.5498227|32.1183755|0.6443136|200.4908016 unknown
InChI: InChI=1S/C18H16N2O3/c21-17(12-6-2-1-3-7-12)20-16(18(22)23)10-13-11-19-15-9-5-4-8-14(13)15/h1-9,11,16,19-20,22H,10H2
charge 0 multiplicity 1
39 atoms
O  -1.188252 4.167618 -0.97915
O  0.705634 3.44464 -2.114333
O  1.220482 1.258275 1.909262
N  -2.08322 -1.488821 1.726331
N  0.966938 1.277292 -0.403992
C  -1.526731 1.169029 -0.870899
C  -1.872938 -0.023622 -0.013142
C  -0.304081 2.003818 -0.368917
C  -2.752094 -1.107445 -0.421436
C  -2.86376 -2.01557 0.691955
C  -1.488214 -0.291118 1.301697
C  -3.456676 -1.401446 -1.619601
C  -3.645133 -3.190429 0.634739
C  -0.169104 3.25314 -1.24065
C  -4.237209 -2.572451 -1.683271
C  -4.330282 -3.457881 -0.568411
C  1.669452 0.966751 0.750857
C  2.99057 0.271442 0.564366
C  3.320915 -0.467983 -0.601652
C  3.925576 0.346323 1.628375
C  4.576723 -1.104996 -0.706976
C  5.181483 -0.285015 1.519265
C  5.512324 -1.009401 0.349175
H  -2.391259 1.860265 -0.929411
H  -1.321263 0.835654 -1.909079
H  -0.475369 2.310059 0.679389
H  -0.812407 0.263476 1.952742
H  -1.939098 -1.917021 2.637725
H  1.43119 1.209354 -1.312723
H  -3.398748 -0.72903 -2.483625
H  -3.721498 -3.872949 1.48874
H  -4.785119 -2.811792 -2.601617
H  -4.946278 -4.360552 -0.648826
H  2.593493 -0.588865 -1.413128
H  3.641103 0.900338 2.528804
H  -1.096729 4.955364 -1.581346
H  4.820681 -1.682222 -1.605401
H  5.90082 -0.215587 2.342482
H  6.486881 -1.502943 0.264681
