program: Gaussian 09
title: 000294865
version: EM64L-G09RevD.01
frameworkgroup: C1[X(C9H13NO)]
method: RPBEPBE
basis: SDD
operation: Freq
keyword: #p
keyword: freq=noraman
keyword: PBEPBE/SDD
title: #p freq=noraman PBEPBE/SDD
converged: YES YES NO NO
title: Mulliken charges:
elementType: O N C C C C C C C C C H H H H H H H H H H H H H
charge: -0.271570 -0.056257 -0.516707 0.172637 -0.268101 -0.369510 0.144071 -0.165550 -0.312150 -0.786639 -0.497275 0.238159 0.221839 0.189582 0.224691 0.242497 0.235215 0.236825 0.252646 0.228193 0.225730 0.202028 0.231582 0.198064
chargesum: 0.00000
title: Mulliken charges with hydrogens summed into heavy atoms:
elementType: O N C C C C C C C C C
charge: -0.271570 -0.056257 -0.056709 0.172637 0.146172 -0.127014 0.144071 0.069665 -0.075325 -0.080070 0.134399
polarizability: 1.38840627e+02 3.55108035e+00 1.10309898e+02 -9.05655231e+00 3.13319825e+00 6.80358403e+01
1716.lowfreq: -13.6656 -1.2806 -0.0007 0.0006 0.0007 7.8000 14.3524 26.5871 72.7089
frequency: 7.6994 25.5798 72.7071 79.1617 97.3436 186.9906 214.9129 227.4398 259.3388 293.7692 375.6836 419.1984 444.9106 538.8012 564.5755 613.2242 721.0181 749.3130 789.6385 813.9135 890.0864 908.7762 929.6636 957.3905 993.1078 996.3173 1042.6523 1046.2111 1054.0320 1075.9886 1091.6931 1115.2160 1157.8211 1169.5336 1173.0841 1225.1918 1264.7289 1266.8160 1295.8072 1326.6577 1370.6464 1386.7290 1393.5984 1437.7295 1447.5839 1458.0641 1459.8872 1464.5129 1469.8903 1470.7197 1492.8284 1574.3113 1582.3010 2917.0316 2926.1901 2982.6224 2988.9540 2993.4279 3010.0603 3060.3730 3076.8319 3099.8038 3115.3452 3129.7069 3144.9423 3162.1140
redmass: 1.1920 2.1197 3.1924 2.3664 2.7790 2.9815 2.9009 1.3185 2.8770 4.3671 2.9192 2.9396 3.1284 4.9527 3.7250 4.8955 4.8990 2.1238 1.4074 1.3921 4.2705 1.4306 2.4367 5.2632 1.3599 1.8213 2.7034 1.6094 2.1930 4.6641 1.5814 1.2532 1.4701 1.1399 1.2175 1.6788 2.1192 1.2093 3.0793 2.6501 1.4480 1.4328 2.0175 1.1497 2.4909 1.0514 1.0989 1.1408 1.0607 1.0477 1.0775 6.5214 5.5456 1.0457 1.0476 1.0381 1.1010 1.1029 1.0593 1.0972 1.1031 1.0969 1.0982 1.0868 1.0929 1.1006
irintensity: 0.3359 3.3724 1.7727 3.7201 2.6729 1.4619 7.8504 4.8671 6.1427 0.8703 3.3966 2.6487 2.5161 3.1390 3.3432 4.2762 1.9847 23.3300 25.3186 9.0383 14.2517 0.0604 4.2475 2.7706 0.7139 7.3287 28.7821 9.4548 13.6756 106.6778 23.3589 0.3484 3.3113 1.1561 4.7035 3.1555 3.2620 2.8925 8.4396 0.9724 19.9345 10.8149 12.0687 0.6292 62.2733 11.9411 16.4686 26.5514 14.6169 13.7594 5.1555 60.7133 42.5618 52.6897 97.0790 21.5633 66.5084 45.0214 18.6132 20.4306 23.0092 36.5766 9.7523 2.4728 22.6997 19.0717
temp: 298.150 k
press: 1.00000 atm
elementType: 8 7 6 6 6 6 6 6 6 6 6 1 1 1 1 1 1 1 1 1 1 1 1 1
symmnumber: 1
zpe: 526908.4 jmol-1
zpe.correction: 0.200689 hartree
zpe.thermalcorrener: 0.212597 hartree
zpe.thermalcorrenthalpy: 0.213541 hartree
zpe.thermalcorrgfe: 0.159333 hartree
zpe.sumelectzpe: -479.871958 hartree
zpe.sumelectthermal: -479.860050 hartree
zpe.sumelectthermalent: -479.859105 hartree
zpe.sumelectthermalfe: -479.913314 hartree
dipole: 1.5804 -0.3450 -1.8913
dipole: 2.4887
quadrupole: -57.7146 -61.7825 -68.3425
quadrupole: -3.1388 3.0538 -0.1328
quadrupole: 4.8986 0.8307 -5.7293 -3.1388 3.0538 -0.1328
hfenergy: -480.0726463 hartree
pointgroup: C01 [X(C9H13N1O1)]
dipole: -0.6469697 0.2160709 -0.7024431 debye
dipolederiv: -1.1536409 0.1856122 0.159418 0.1877251 -0.4600078 -0.0291235 0.1777418 -0.0228859 -0.4444951 -0.5881441 -0.14531 -0.0442374 -0.1718747 -0.4067926 -0.0042225 -0.054729 -0.0160815 -0.253993 -0.2872368 0.0574106 0.0338479 0.2011893 0.1152342 -0.0063893 0.0488644 -0.0274135 0.0351079 0.7845196 0.0265338 0.1013707 -0.1075728 0.1060673 -0.0574191 0.2376847 -0.0191407 0.0287752 0.8640301 -0.078613 -0.0100161 -0.1031397 0.3474628 -0.1060893 -0.017185 -0.1187351 0.2985851 -0.4189876 0.0220893 -0.0268935 0.2139908 -0.0425194 0.0382523 -0.0795462 -0.0016198 -0.1494601 0.2333617 0.1556113 0.0352926 0.3584142 0.6370199 0.0201425 0.019128 -0.0066368 0.0384548 0.2189876 0.0065009 0.0708626 0.031041 0.1888858 -0.0209419 0.0745391 -0.0139299 -0.09088 -0.016864 0.0698649 0.0423485 -0.1904073 -0.4130939 -0.0128746 0.0389904 0.0317312 -0.1508576 -0.0734982 -0.1777981 -0.0112862 -0.1339864 -0.1908195 -0.0131606 -0.0126961 -0.0170867 0.0540008 0.484531 -0.0906807 -0.1369868 -0.2001724 0.4159823 0.0373121 -0.3464841 0.0641244 0.410015 0.0521382 -0.0013088 -0.034054 0.0043163 0.0543165 0.0892016 -0.0266543 0.051522 -0.0594403 0.0445553 -0.0216289 -0.0157409 -0.0681515 -0.1271531 -0.0506873 0.0150562 -0.0149997 0.0786694 -0.0495726 0.0166893 0.0093457 0.0152158 -0.0044379 0.112899 -0.0638792 0.096437 -0.1780635 -0.0170471 -0.0184248 -0.0153067 -0.0854512 -0.1405667 -0.0475319 -0.0504511 -0.0124987 0.0426298 0.0543792 -0.0947941 -0.0227975 -0.0930936 -0.0568361 -0.0065406 -0.0223926 -0.0089312 0.1513916 0.0248953 0.0921856 -0.02886 0.0962704 -0.0535902 0.0322754 -0.0341602 0.0337513 0.1359721 -0.1093996 -0.0257543 -0.0575248 -0.025823 0.0948637 -0.0034291 -0.0611816 -0.0032255 0.1466825 0.02177 0.1458746 -0.029298 0.0509498 0.00223 0.0153409 -0.0237938 0.0336052 0.1068451 -0.0266963 -0.0497931 0.1197322 -0.0231537 0.0393165 -0.0111789 0.1286944 0.0391063 0.005265 0.0706464 -0.0361523 -0.0848517 -0.0344908 0.0334168 -0.0059148 -0.0990944 -0.0677619 -0.0865178 0.0311769 -0.0913507 0.0098195 0.0439018 -0.2285685 -0.0638216 0.0892816 -0.0521728 0.0337352 -0.1866444 0.016308 -0.050406 0.0053802 0.0990501 -0.0223429 -0.073956 -0.0174367 0.0575723 0.0427406 0.0369283 -0.013778 0.0289225 -0.0094603 0.1162442 0.1362229 0.070279 -0.2099943 unknown
polarizability: 139.5961778|2.1273354|110.4249632|6.3778418|0.4624608|67.1652237 unknown
InChI: InChI=1S/C9H13NO/c1-8-4-3-5-9(10-8)6-7-11-2/h3-5H,6-7H2,1-2H3
charge 0 multiplicity 1
24 atoms
O  3.602432 -0.015415 0.170374
N  -0.701491 -0.622746 0.359962
C  1.359828 0.641952 0.775248
C  -0.117014 0.618549 0.426894
C  2.211626 -0.06234 -0.29401
C  -0.848971 1.80513 0.179286
C  -2.030238 -0.718449 0.049145
C  -2.223049 1.707338 -0.139709
C  -2.823312 0.433338 -0.206121
C  -2.624454 -2.111806 -0.006203
C  4.513307 -0.679385 -0.757436
H  1.522813 0.113062 1.732491
H  1.716012 1.679966 0.897425
H  2.119244 0.452125 -1.27764
H  1.870084 -1.112633 -0.411275
H  -0.351228 2.778274 0.240095
H  -2.81323 2.610038 -0.332267
H  -3.885553 0.322512 -0.448938
H  -1.840152 -2.85568 0.202243
H  -3.432919 -2.232272 0.739215
H  -3.06226 -2.323755 -0.999609
H  4.257383 -1.753657 -0.882848
H  5.520775 -0.593045 -0.320237
H  4.504166 -0.194299 -1.757885
