program: Gaussian 09
title: 000294861
version: EM64L-G09RevD.01
frameworkgroup: C1[X(C7H16S)]
method: RPBEPBE
basis: SDD
operation: Freq
keyword: #pfreq=noraman
keyword: PBEPBE/SDD
title: #p freq=noraman PBEPBE/SDD
converged: NO YES NO NO
title: Mulliken charges:
elementType: S C C C C C C C H H H H H H H H H H H H H H H H
charge: 0.148549 -0.319003 -0.654570 -0.340056 -0.613910 -0.339936 -0.686781 -0.671069 0.207275 0.207192 0.243267 0.243239 0.193166 0.193110 0.240494 0.240605 0.215182 0.215293 0.216281 0.211129 0.211113 0.209037 0.221364 0.209028
chargesum: 0.00000
title: Mulliken charges with hydrogens summed into heavy atoms:
elementType: S C C C C C C C
charge: 0.148549 0.095464 -0.168064 0.046221 -0.132811 0.090540 -0.048258 -0.031640
polarizability: 1.34457818e+02 -5.53808023e-01 8.24409303e+01 -3.26406823e-03 1.82571884e-02 7.15146665e+01
1716.lowfreq: -3.4180 -0.0032 -0.0029 -0.0012 5.1493 8.5880 30.0099 49.4134 63.5494
frequency: 29.0208 49.3466 63.5296 91.5392 101.6146 116.1617 166.0716 225.2529 230.2186 236.1151 290.4398 363.9745 406.1915 700.0170 720.8111 737.5161 751.3980 788.0433 859.5949 891.5657 901.0293 912.7198 1024.9486 1039.3849 1047.5760 1058.0261 1073.7508 1092.9737 1113.9312 1202.5888 1215.9277 1221.3687 1256.3750 1273.3841 1285.6811 1292.1065 1306.9189 1336.8936 1350.7877 1388.9152 1390.7466 1450.6246 1457.6577 1469.8475 1476.1028 1476.4310 1476.9773 1478.2193 1486.0884 1488.0703 2967.3308 2972.9946 2974.8084 2980.2654 2987.8843 2992.7957 2995.7910 3009.7085 3034.4716 3036.2341 3061.4123 3065.8257 3072.5536 3073.6503 3075.8803 3080.2495
redmass: 3.0154 1.5955 3.9029 2.4126 2.3315 2.1063 3.3201 1.1045 1.1129 3.7835 3.2264 5.0854 2.8742 5.2644 5.9862 1.0695 1.0808 1.1450 1.1806 1.8757 1.8687 1.2019 3.8815 1.1375 2.7601 1.1579 2.5286 2.0059 2.3184 1.5307 1.4222 1.2216 1.2418 1.2082 1.1047 1.0611 1.3259 1.4426 1.5408 1.2105 1.2080 1.0862 1.0886 1.0666 1.0507 1.0424 1.0664 1.0420 1.0814 1.0829 1.0575 1.0376 1.0354 1.0588 1.0584 1.0557 1.0573 1.1001 1.1018 1.1039 1.1057 1.1057 1.0995 1.1035 1.0993 1.1043
irintensity: 0.1292 0.0034 0.2373 0.9724 1.0601 0.1078 0.6562 0.0001 0.0181 0.6096 0.4726 0.7882 0.4404 9.7266 1.2165 9.5370 12.3166 0.4479 0.2073 10.5022 3.7790 2.5474 0.1151 1.1110 1.7122 0.3214 0.8034 24.7686 0.4194 0.3707 0.0336 12.6435 8.2335 0.2073 0.0303 0.2611 10.8577 3.3994 4.3779 8.7387 13.0430 7.0240 0.8720 0.8119 3.1573 12.7723 2.8283 13.3943 12.6417 15.7292 21.0099 34.4058 33.9726 20.6915 5.4752 87.9014 27.4632 3.8156 0.1091 5.7549 3.6064 1.3367 51.9643 142.8076 48.1083 83.3185
temp: 298.150 k
press: 1.00000 atm
elementType: 16 6 6 6 6 6 6 6 1 1 1 1 1 1 1 1 1 1 1 1 1 1 1 1
symmnumber: 1
zpe: 563718.2 jmol-1
zpe.correction: 0.214709 hartree
zpe.thermalcorrener: 0.226600 hartree
zpe.thermalcorrenthalpy: 0.227545 hartree
zpe.thermalcorrgfe: 0.175216 hartree
zpe.sumelectzpe: -673.711189 hartree
zpe.sumelectthermal: -673.699298 hartree
zpe.sumelectthermalent: -673.698354 hartree
zpe.sumelectthermalfe: -673.750683 hartree
dipole: 0.0178 1.7297 0.0039
dipole: 1.7298
quadrupole: -54.5091 -61.3876 -60.2175
quadrupole: -0.5436 -0.0040 0.0029
quadrupole: 4.1957 -2.6829 -1.5128 -0.5436 -0.0040 0.0029
hfenergy: -673.9258983 hartree
pointgroup: C01 [X(C7H16S1)]
dipole: 0.0083131 -0.6801724 -0.0212994 debye
dipolederiv: -0.4102873 -0.0013655 -0.0001774 -0.0002323 -0.0529952 0.0050893 -0.0001762 0.0048871 -0.2148558 -0.0888268 -0.0074266 -0.0004648 0.225813 0.0428354 -0.0032954 0.0061978 -0.0032742 0.1584439 0.268302 -0.1585242 -0.0046642 -0.2336987 0.0976141 -0.0027897 -0.0072315 -0.0028361 0.1832611 -0.0082867 0.0027114 -0.0000509 -0.1366474 0.1191642 -0.0018041 -0.0038806 -0.0016332 0.1866087 0.2658221 0.1571538 0.0049225 0.2588497 0.080228 -0.0027146 0.0082513 -0.003037 0.1817997 -0.0027978 0.0066908 0.0001723 -0.2259536 0.0615653 -0.0030529 -0.006637 -0.0025282 0.1501108 -0.0837724 -0.0341583 -0.0010962 0.0344304 0.053271 -0.0010803 0.0006057 -0.0011394 0.0945948 -0.1103421 -0.0575273 -0.0016308 0.0510507 0.0625996 -0.0008898 0.0015549 -0.0009912 0.1055379 0.062562 0.0014312 0.0131279 -0.0242078 -0.0282979 0.1088782 0.0216699 0.1184935 -0.0629225 0.0631635 0.0027799 -0.0125765 -0.0225658 -0.0158687 -0.1062145 -0.0223849 -0.1158018 -0.0753476 -0.0222944 0.0266012 -0.0100606 0.0535676 -0.0541168 -0.1079341 -0.0100213 -0.1187452 -0.0686921 -0.0222713 0.0262038 0.0113858 0.0531568 -0.0680033 0.108092 0.0131806 0.1188099 -0.0550114 0.0312375 -0.0342525 0.0350398 -0.0021368 -0.0495829 0.1214734 0.0146649 0.1494965 -0.0824285 0.0314714 -0.0319989 -0.0365349 -0.0010516 -0.0352856 -0.1189969 -0.0144467 -0.1470761 -0.0968469 -0.0251036 -0.0233739 -0.0103886 -0.0563209 -0.0685759 0.1104877 -0.008925 0.1193186 -0.056494 -0.0251535 -0.0234059 0.0092784 -0.056184 -0.0542697 -0.1104861 0.0055937 -0.1192462 -0.0705205 0.0572685 -0.0232709 -0.0097757 0.0171656 -0.0143205 -0.1120262 0.0185047 -0.1259463 -0.0740596 0.0567016 -0.0233204 0.0083442 0.0184588 -0.0278457 0.114809 -0.017796 0.1286837 -0.0606426 -0.1669614 0.1116306 0.0026676 0.1438835 -0.0173406 -0.0029827 0.0035017 -0.0030337 0.1011097 0.0757101 -0.007867 0.01134 -0.0581524 -0.0022648 -0.1204503 -0.0406999 -0.1316174 -0.0940376 0.0756847 -0.007576 -0.0113637 -0.0605335 -0.0159586 0.1244945 0.0379366 0.135778 -0.0803234 0.0904996 0.0104954 -0.031353 -0.0438881 -0.02472 0.1223782 0.0144019 0.1382336 -0.0799457 -0.2028336 0.0799741 0.0023649 0.1086402 0.0227031 -0.0024352 0.0034023 -0.0023703 0.1048194 0.090508 0.0083953 0.031494 -0.0434434 -0.0105347 -0.1185497 -0.0172669 -0.1344247 -0.0941579 unknown
polarizability: 134.4554504|0.6523175|82.4329391|0.0687715|0.3361806|71.5250247 unknown
InChI: InChI=1S/C7H16S/c1-3-5-7-8-6-4-2/h3-7H2,1-2H3
charge 0 multiplicity 1
24 atoms
S  -0.655544 0.874245 0.035842
C  2.117017 0.363674 0.020313
C  0.767794 -0.37727 -0.002236
C  3.319848 -0.610459 -0.004119
C  -2.109838 -0.341025 -0.004001
C  -3.440801 0.434059 0.018323
C  4.676701 0.127277 0.017218
C  -4.658288 -0.518208 -0.006854
H  2.177233 1.046292 -0.850611
H  2.174216 0.997466 0.927629
H  0.665738 -0.98407 -0.920839
H  0.66588 -1.038557 0.877975
H  3.255922 -1.294561 0.866453
H  3.258263 -1.247497 -0.909874
H  -2.027145 -1.00554 0.875837
H  -2.024477 -0.949957 -0.922928
H  -3.478876 1.067938 0.925238
H  -3.480229 1.117337 -0.851864
H  5.52263 -0.584333 -0.000756
H  4.775172 0.748496 0.927365
H  4.777295 0.79614 -0.858267
H  -4.654041 -1.194197 0.8689
H  -5.604884 0.052157 0.010015
H  -4.656189 -1.144908 -0.918559
