program: Gaussian 09
title: 000294914
version: EM64L-G09RevD.01
frameworkgroup: C1[X(C21H24N2O5)]
method: RPBEPBE
basis: SDD
operation: Freq
keyword: #p
keyword: freq=noraman
keyword: PBEPBE/SDD
title: #p freq=noraman PBEPBE/SDD
converged: YES YES NO NO
title: Mulliken charges:
elementType: O O O O O N N C C C C C C C C C C C C C C C C C C C C C H H H H H H H H H H H H H H H H H H H H H H H H
charge: -0.249329 -0.285295 -0.277823 -0.272316 -0.326472 -0.369431 -0.366361 -0.211395 -0.368789 0.245879 -0.502462 -0.727292 0.298576 0.326449 -0.492918 0.481911 -0.490275 0.478754 -0.399098 -0.374739 -0.404971 -0.369227 -0.222217 -0.222805 -0.224129 -0.237200 -0.257986 -0.233556 0.261487 0.258631 0.229762 0.265418 0.246396 0.376596 0.245155 0.234311 0.224210 0.331781 0.243992 0.225027 0.264275 0.222221 0.233477 0.276006 0.233536 0.278633 0.228327 0.250905 0.227975 0.230626 0.235382 0.230387
chargesum: 0.00000
title: Mulliken charges with hydrogens summed into heavy atoms:
elementType: O O O O O N N C C C C C C C C C C C C C C C C C C C C C
charge: -0.249329 -0.285295 -0.277823 -0.272316 -0.326472 0.007166 -0.034580 0.050092 0.119604 0.245879 0.009352 -0.023616 0.298576 0.326449 -0.023899 0.481911 -0.003778 0.478754 -0.165621 -0.098733 -0.171435 -0.090594 0.006109 0.028100 0.003847 -0.006574 -0.022604 -0.003169
polarizability: 3.05945986e+02 1.75363715e+00 2.42836866e+02 3.12666988e+00 -1.34607532e+01 2.00084194e+02
1716.lowfreq: -7.4567 -0.0008 -0.0004 0.0006 4.5323 5.4561 12.6285 15.7310 21.0913
frequency: 10.8031 15.5091 21.0731 29.6007 37.1470 41.7267 45.4085 47.9273 63.1426 69.8910 74.2636 97.9726 108.2919 138.1429 155.0023 161.0955 167.9682 208.0193 212.5056 226.7248 244.7138 259.5002 269.0706 299.9464 309.9723 319.5417 352.4280 363.4502 390.5608 405.2272 406.2677 437.9213 463.2859 479.7590 506.0101 515.8382 552.7668 556.9555 593.1390 598.4166 617.0210 617.6765 630.9370 640.0901 658.3413 696.8577 703.8076 708.5749 738.2156 748.4919 755.6916 759.5547 785.3854 814.8401 818.8264 834.2483 856.1564 862.5676 864.6172 868.3043 891.0287 913.6785 937.0303 938.5432 974.4465 978.9596 984.3584 986.5457 990.1511 990.4910 1001.7086 1004.9418 1008.8111 1009.5534 1027.8415 1027.9333 1038.4953 1048.2342 1086.4762 1090.7474 1091.7451 1124.7620 1140.9048 1157.1233 1173.4469 1174.7348 1186.7247 1190.1410 1191.2969 1214.1184 1221.6665 1222.2812 1225.5177 1237.1362 1244.5110 1259.8973 1312.2909 1330.9028 1332.2263 1335.2856 1338.8323 1356.5520 1358.0724 1362.4338 1384.9229 1385.2615 1393.0738 1426.6172 1441.8900 1442.1877 1459.5635 1463.1200 1463.5851 1467.5941 1472.5924 1483.2762 1485.0014 1485.3693 1501.0360 1593.3847 1593.5189 1613.5017 1614.3645 1617.5422 1629.0415 1635.0629 2998.5419 3002.6147 3007.7526 3026.3508 3035.3104 3037.9041 3064.9935 3082.3162 3101.0277 3104.3029 3109.3444 3114.0610 3119.5570 3120.6817 3126.8994 3129.3956 3138.6940 3140.8869 3148.9391 3151.4654 3164.1304 3164.5476 3469.2893 3563.4085
redmass: 4.4728 4.7313 5.7781 5.7319 5.1714 4.5900 5.5496 5.1962 6.1844 8.5971 5.2977 7.7955 3.5750 3.9169 5.2149 5.5076 4.4577 1.1205 4.3550 3.9186 5.6034 5.3254 3.6644 4.3886 3.9234 3.9799 3.1281 2.3694 2.7327 2.8389 2.8505 3.5087 3.3545 3.0251 3.5629 4.2258 1.6369 2.1229 4.4053 4.2798 6.2710 6.3103 3.6413 4.5089 4.7895 8.2414 1.8833 1.9389 1.5263 2.4887 2.1060 2.1688 2.8604 3.5046 3.4575 3.6923 3.1871 1.3148 1.3268 4.1172 2.8963 2.5190 1.5019 1.4927 1.8333 1.8116 1.4234 1.6429 3.3759 5.4885 3.3244 1.3452 2.1332 1.3584 2.2235 2.2145 2.3228 1.8694 3.5529 1.5396 1.5325 2.8891 3.0115 2.9144 1.0544 1.0566 1.2768 1.1269 1.1198 2.2169 2.8226 2.8355 1.7114 1.1844 1.1651 1.2718 1.4813 1.2695 1.2508 1.3874 1.3700 1.4764 1.2468 1.3775 7.6781 7.6163 1.2224 1.0935 2.1624 2.1704 1.0929 1.1374 1.1329 1.1076 1.3674 1.3685 2.0984 2.1456 1.8699 6.0472 6.0633 6.1113 6.0995 7.8733 7.0405 8.0116 1.0357 1.0654 1.0604 1.0853 1.0587 1.0588 1.0984 1.0997 1.1005 1.0997 1.1072 1.1071 1.0866 1.0866 1.0871 1.0876 1.0920 1.0921 1.0963 1.0964 1.1016 1.1015 1.0793 1.0778
irintensity: 0.1575 0.0812 0.0828 1.0002 0.4127 0.5319 0.5041 1.0259 4.6232 6.3715 1.1637 11.6785 1.3387 1.9943 0.2308 1.6820 3.8214 0.8004 4.5778 5.2742 1.3152 10.0544 6.6942 8.6853 1.2536 11.8464 17.3883 15.9612 7.8771 0.0149 0.2773 2.0494 12.8661 4.8639 0.1208 13.6680 54.3336 57.4530 9.1914 21.5549 0.1051 0.2888 6.8577 6.1452 2.1322 17.6119 50.2576 57.7239 113.4709 26.9147 66.0563 89.2140 0.1542 9.8290 8.3940 0.8959 9.1144 4.3205 6.0226 48.7559 58.0602 1.2715 3.3376 3.3997 5.8071 2.4562 0.6280 6.7932 6.6621 1.5011 165.6770 0.6608 27.0177 12.7598 2.0708 6.0138 15.1805 45.9607 18.2913 8.0603 6.7914 186.7675 145.6040 53.3365 0.1062 0.7853 30.8273 3.6725 1.8898 250.9015 18.4108 24.7723 24.0176 14.1921 15.1254 35.7881 28.9993 7.0196 4.8536 27.7336 26.1884 42.6702 18.2637 4.5939 1.3558 0.3794 34.0437 35.7387 9.4561 10.0473 43.7195 6.6971 13.3618 18.1879 226.7191 51.9717 19.1346 55.4766 256.4400 2.3826 2.5516 1.3327 1.4420 31.1282 113.1615 421.2188 22.8557 36.4825 9.5858 6.8384 18.5153 32.8091 15.8447 3.5031 15.6290 22.7021 5.1423 6.1975 5.4229 5.3445 1.0019 2.9606 16.0994 15.5297 26.6519 24.0418 23.6624 18.3192 90.3569 46.0904
temp: 298.150 k
press: 1.00000 atm
elementType: 8 8 8 8 8 7 7 6 6 6 6 6 6 6 6 6 6 6 6 6 6 6 6 6 6 6 6 6 1 1 1 1 1 1 1 1 1 1 1 1 1 1 1 1 1 1 1 1 1 1 1 1
symmnumber: 1
zpe: 1095322.9 jmol-1
zpe.correction: 0.417186 hartree
zpe.thermalcorrener: 0.444395 hartree
zpe.thermalcorrenthalpy: 0.445339 hartree
zpe.thermalcorrgfe: 0.354133 hartree
zpe.sumelectzpe: -1298.243813 hartree
zpe.sumelectthermal: -1298.216604 hartree
zpe.sumelectthermalent: -1298.215660 hartree
zpe.sumelectthermalfe: -1298.306866 hartree
dipole: -2.8507 1.7103 -0.3618
dipole: 3.3440
quadrupole: -158.6517 -152.1645 -161.5133
quadrupole: 13.2818 6.7301 -7.2154
quadrupole: -1.2085 5.2787 -4.0701 13.2818 6.7301 -7.2154
hfenergy: -1298.660999 hartree
pointgroup: C01 [X(C21H24N2O5)]
dipole: -0.718391 1.0805629 -0.2172756 debye
polarizability: 295.4606591|-23.6675104|251.2798495|-1.1894238|-16.9945333|202.1265369 unknown
InChI: InChI=1S/C21H24N2O5/c1-16(23-21(26)28-15-18-10-6-3-7-11-18)20(25)22-13-12-19(24)27-14-17-8-4-2-5-9-17/h2-11,16,22-23H,12-15H2,1H3
charge 0 multiplicity 1
52 atoms
O  3.655774 1.721612 -0.282213
O  -1.546151 -1.536027 -1.21461
O  2.691918 -4.436507 -0.547842
O  2.940643 0.401877 1.506611
O  -0.210224 -1.112734 0.693778
N  2.587606 -2.427599 0.644483
N  -0.345669 -3.232364 -0.293212
C  0.593236 -3.878616 0.648453
C  3.943196 -1.986821 0.288426
C  2.060814 -3.618012 0.191661
C  3.950079 -0.652626 -0.485962
C  0.310837 -5.384605 0.733594
C  3.455979 0.507295 0.36603
C  -0.658902 -1.90047 -0.191145
C  3.189749 2.963971 0.447811
C  1.793194 3.36444 0.030239
C  -1.986817 -0.099513 -1.215175
C  -3.255891 0.101241 -0.414119
C  1.603532 4.360425 -0.961128
C  0.658071 2.762881 0.635337
C  -4.51488 0.152749 -1.063667
C  -3.200822 0.247953 0.997625
C  0.301929 4.75561 -1.343115
C  -0.643194 3.158737 0.254358
C  -5.701258 0.344525 -0.319722
C  -4.38569 0.435945 1.742029
C  -0.824369 4.156691 -0.732638
C  -5.638649 0.486809 1.085797
H  0.436523 -3.396703 1.630952
H  4.384987 -2.784997 -0.331937
H  4.549961 -1.88189 1.20768
H  3.311336 -0.723207 -1.386558
H  4.969924 -0.417835 -0.843193
H  1.993007 -1.776211 1.17265
H  0.560853 -5.876569 -0.222469
H  0.944425 -5.845647 1.509699
H  -0.748035 -5.567103 0.986906
H  -0.709185 -3.763011 -1.086413
H  3.251582 2.753594 1.529329
H  3.938266 3.715358 0.152201
H  -1.153708 0.508167 -0.822605
H  -2.142778 0.110253 -2.285026
H  2.477177 4.827171 -1.432918
H  0.801167 1.984743 1.393576
H  -4.565491 0.040097 -2.153834
H  -2.228281 0.190728 1.500391
H  0.16634 5.529166 -2.107163
H  -1.516002 2.698789 0.730905
H  -6.668804 0.383677 -0.832601
H  -4.333273 0.544513 2.831176
H  -1.835479 4.465807 -1.020822
H  -6.557453 0.635844 1.664194
