program: Gaussian 09
title: 000294853
version: EM64L-G09RevD.01
frameworkgroup: C1[X(C12H15N)]
method: RPBEPBE
basis: SDD
operation: Freq
keyword: #pfreq=noraman
keyword: PBEPBE/SDD
title: #p freq=noraman PBEPBE/SDD
converged: YES YES NO NO
title: Mulliken charges:
elementType: N C C C C C C C C C C C C H H H H H H H H H H H H H H H
charge: -0.462108 0.240617 -0.528438 0.137742 0.155093 0.220130 -0.364034 -0.418154 -0.801915 -0.363976 -0.690591 -0.260282 -0.222455 0.193087 0.204049 0.297042 0.216508 0.205221 0.230088 0.232259 0.244455 0.237833 0.224644 0.207598 0.209623 0.221267 0.216793 0.217905
chargesum: 0.00000
title: Mulliken charges with hydrogens summed into heavy atoms:
elementType: N C C C C C C C C C C C C
charge: -0.165066 0.240617 -0.131302 0.137742 0.155093 0.220130 0.057695 -0.188066 -0.087367 -0.139333 -0.052104 -0.043489 -0.004551
polarizability: 1.72938966e+02 -1.58667495e+01 1.58483108e+02 8.00739188e+00 6.04033422e+00 7.74555119e+01
1716.lowfreq: -5.2266 -0.0002 0.0000 0.0006 10.5542 13.0851 43.5631 64.7370 81.6028
frequency: 43.4627 64.6143 81.5962 105.2545 129.4126 198.9526 217.7794 234.0434 265.1072 292.2725 313.7307 390.4586 431.7443 484.0202 489.4934 508.3403 576.2743 582.9127 648.6315 655.6949 729.0262 739.8376 747.3493 766.6938 828.0574 847.8764 864.6703 884.8997 920.7291 926.2050 965.9261 982.5874 1012.1854 1041.6377 1049.0726 1088.6619 1093.9808 1120.2973 1151.1707 1169.6011 1222.8147 1235.3185 1243.5001 1281.8519 1286.4436 1304.8004 1338.2381 1343.9018 1386.9691 1396.4468 1414.3519 1428.3259 1464.5551 1468.4629 1471.7383 1473.0161 1475.7521 1476.9148 1482.1719 1488.4746 1580.9609 1599.0168 1634.1177 2963.0721 2964.8904 2970.1849 2983.8617 3008.1523 3032.6021 3036.8022 3068.2665 3070.9744 3094.4394 3118.7913 3125.9229 3140.3700 3159.2397 3604.6901
redmass: 2.7014 1.7413 3.5401 1.0912 2.8607 3.6405 1.2345 2.7068 2.2071 4.0241 2.9955 5.0410 2.9043 5.3795 1.1961 2.9628 3.8671 4.0076 4.7909 4.4804 2.1589 1.4513 1.4648 3.4110 1.9498 1.5136 2.6929 1.9108 2.3184 1.3880 1.2946 1.5351 2.0388 1.4597 3.0056 2.1277 2.1430 1.5387 2.0087 1.2360 1.4091 1.6007 1.7558 1.3783 1.1333 3.4539 1.5120 1.7867 1.2151 1.5413 2.7886 2.7477 1.3853 1.1418 1.6576 1.2538 1.0529 1.2252 2.1197 1.1243 6.5396 6.5055 6.7063 1.0584 1.0403 1.0361 1.0606 1.0983 1.0980 1.1021 1.1014 1.0991 1.0950 1.0846 1.0889 1.0949 1.1000 1.0803
irintensity: 0.3500 0.0348 1.0990 0.1388 3.2520 0.3749 0.0354 0.7138 0.0056 0.5188 0.3209 1.8288 6.8444 0.0875 84.5295 6.2866 3.5955 10.6001 4.1093 4.6941 4.5820 10.7373 86.0213 7.9187 1.0498 0.0261 0.2801 8.9038 0.3891 3.1531 0.0111 0.6223 10.5697 3.2106 0.1311 1.3227 7.1736 7.6172 6.3788 2.8227 6.3065 11.8566 11.6136 1.7171 0.2225 32.2832 5.1949 14.3494 10.7392 2.9070 29.9057 22.2896 8.6858 15.7993 19.2109 8.9621 8.6435 7.0405 7.3864 16.8628 2.6401 8.8856 4.2296 22.1942 63.9940 56.0853 41.7305 6.8737 22.6879 11.3805 79.2978 49.5023 15.9747 3.1583 4.1631 42.4799 33.0641 44.2118
temp: 298.150 k
press: 1.00000 atm
elementType: 7 6 6 6 6 6 6 6 6 6 6 6 6 1 1 1 1 1 1 1 1 1 1 1 1 1 1 1
symmnumber: 1
zpe: 624957.1 jmol-1
zpe.correction: 0.238034 hartree
zpe.thermalcorrener: 0.250702 hartree
zpe.thermalcorrenthalpy: 0.251646 hartree
zpe.thermalcorrgfe: 0.198676 hartree
zpe.sumelectzpe: -520.093325 hartree
zpe.sumelectthermal: -520.080657 hartree
zpe.sumelectthermalent: -520.079713 hartree
zpe.sumelectthermalfe: -520.132683 hartree
dipole: -0.6106 2.4854 0.3510
dipole: 2.5833
quadrupole: -73.8642 -66.0376 -83.1253
quadrupole: 2.3048 2.0427 2.2924
quadrupole: 0.4782 8.3048 -8.7830 2.3048 2.0427 2.2924
hfenergy: -520.3313586 hartree
pointgroup: C01 [X(C12H15N1)]
dipole: -0.3050546 -0.9645799 -0.0974274 debye
polarizability: 174.968268|14.4360638|156.845596|-8.3101505|3.2158306|77.063722 unknown
InChI: InChI=1S/C12H15N/c1-3-6-10-9(2)13-12-8-5-4-7-11(10)12/h4-5,7-8,13H,3,6H2,1-2H3
charge 0 multiplicity 1
28 atoms
N  0.692523 -1.973059 -0.104048
C  -0.830408 -0.322675 0.331349
C  -2.115257 0.424078 0.598279
C  0.485428 0.279565 0.177837
C  -0.669186 -1.702142 0.152915
C  1.422263 -0.779896 -0.093735
C  -2.718861 1.098705 -0.666994
C  0.964274 1.61434 0.251711
C  -1.673185 -2.819335 0.191776
C  2.799537 -0.541494 -0.289963
C  -3.9969 1.9049 -0.353018
C  2.338371 1.860875 0.057221
C  3.246572 0.794716 -0.212121
H  -2.875885 -0.255037 1.032614
H  -1.936347 1.209548 1.361243
H  1.078386 -2.901286 -0.262636
H  -1.956665 1.760044 -1.123073
H  -2.939159 0.316447 -1.419971
H  0.276697 2.44254 0.459585
H  -1.394736 -3.600118 0.926345
H  -2.664813 -2.432486 0.47732
H  -1.781746 -3.313572 -0.793758
H  3.501995 -1.357674 -0.494878
H  -4.778886 1.256995 0.087321
H  -3.787596 2.71471 0.371742
H  -4.416207 2.368493 -1.264788
H  2.720652 2.886447 0.112744
H  4.309438 1.017167 -0.359917
