program: Gaussian 09
title: 000294849
version: EM64L-G09RevD.01
frameworkgroup: C1[X(C8H14O2)]
method: RPBEPBE
basis: SDD
operation: Freq
keyword: #pfreq=noraman
keyword: PBEPBE/SDD
title: #p freq=noraman PBEPBE/SDD
converged: YES YES NO NO
title: Mulliken charges:
elementType: O O C C C C C C C C H H H H H H H H H H H H H H
charge: -0.436974 -0.267788 -0.540693 0.565402 -0.359133 -0.525780 -0.680777 -0.689655 -0.476723 0.157784 0.217827 0.202339 0.219473 0.204491 0.260558 0.197609 0.211445 0.213272 0.222969 0.247784 0.206960 0.222940 0.253769 0.372902
chargesum: 0.00000
title: Mulliken charges with hydrogens summed into heavy atoms:
elementType: O O C C C C C C C C
charge: -0.064072 -0.267788 -0.120527 0.565402 0.064831 -0.067613 -0.033092 -0.011971 -0.222954 0.157784
polarizability: 1.27583956e+02 -9.08054108e+00 9.74561453e+01 2.27725409e+00 5.16782975e+00 6.87273882e+01
1716.lowfreq: -9.9355 -0.0003 0.0004 0.0006 7.1149 12.1219 47.0393 55.2481 67.8914
frequency: 46.4193 55.0933 67.8526 71.9499 113.4591 192.7050 219.6577 223.0301 228.7120 261.3995 285.2610 349.3447 388.5832 496.4480 587.1698 619.7669 672.7105 710.7020 745.8888 778.4154 810.5822 864.4406 869.3404 902.2188 938.2347 979.8136 1031.2922 1045.5261 1052.7110 1064.6195 1090.2304 1116.9301 1188.8718 1222.2469 1245.3028 1271.0541 1283.6211 1295.8375 1302.5699 1331.9312 1372.3989 1389.3574 1392.1795 1462.0208 1469.4748 1474.5745 1475.1080 1476.8513 1484.2345 1487.7014 1629.8054 1644.7968 2968.6623 2974.5271 2983.5733 2986.9224 2994.4353 3024.7456 3047.3397 3067.2931 3074.4659 3076.3255 3084.4822 3098.9363 3144.3706 3521.7342
redmass: 2.8166 3.3582 7.5040 1.7903 2.9243 1.8808 1.4163 3.1160 1.2230 3.1681 3.1135 2.6291 3.4317 3.0938 1.2715 3.3905 3.8279 3.6074 1.1128 1.9219 1.5050 1.4361 1.8465 1.4957 3.7115 2.4258 1.9493 2.5105 1.9421 1.7154 2.0541 1.4932 1.8330 1.3589 1.4336 1.2975 1.1343 1.7858 1.3143 1.4304 1.4217 1.2121 1.4095 1.0925 1.0854 1.0485 1.0612 1.0481 1.0762 1.0882 7.1314 6.9174 1.0593 1.0366 1.0355 1.0599 1.0629 1.0983 1.1024 1.0979 1.1019 1.0992 1.0992 1.1016 1.0908 1.0640
irintensity: 0.1369 0.0952 1.6586 0.0965 0.4285 0.5449 0.2018 0.9124 0.0463 0.7798 0.3264 7.0860 3.8268 23.7235 112.6635 35.3586 16.8816 19.3527 4.5569 4.2226 24.5009 15.4377 6.3498 6.3549 40.6167 39.9681 2.4679 185.6462 182.7084 2.8578 18.6302 14.2891 11.0456 0.7566 3.0135 5.6895 0.7549 22.4015 5.7681 5.5668 19.7465 7.1801 32.9739 8.8031 11.5945 1.5453 4.8604 11.9998 12.2108 28.2865 226.2097 185.9425 10.1345 45.0781 31.9059 37.0301 34.3228 2.7955 12.8490 6.0263 84.1515 43.4565 27.5950 31.3339 6.3709 39.4722
temp: 298.150 k
press: 1.00000 atm
elementType: 8 8 6 6 6 6 6 6 6 6 1 1 1 1 1 1 1 1 1 1 1 1 1 1
symmnumber: 1
zpe: 537292.3 jmol-1
zpe.correction: 0.204644 hartree
zpe.thermalcorrener: 0.216814 hartree
zpe.thermalcorrenthalpy: 0.217758 hartree
zpe.thermalcorrgfe: 0.165425 hartree
zpe.sumelectzpe: -462.893697 hartree
zpe.sumelectthermal: -462.881527 hartree
zpe.sumelectthermalent: -462.880583 hartree
zpe.sumelectthermalfe: -462.932917 hartree
dipole: -2.2415 -0.1750 -0.4352
dipole: 2.2901
quadrupole: -58.7295 -62.0730 -62.9789
quadrupole: -3.6725 -1.0003 -0.9110
quadrupole: 2.5309 -0.8125 -1.7184 -3.6725 -1.0003 -0.9110
hfenergy: -463.0983413 hartree
pointgroup: C01 [X(C8H14O2)]
dipole: -0.8827403 0.0144575 0.1798489 debye
dipolederiv: -0.7082027 -0.5528963 -0.2195979 -0.5775208 -1.0516146 -0.1512898 -0.2188262 -0.1540166 -0.4514581 -0.8797007 0.0919705 0.2015406 0.1100573 -0.7175622 -0.2141379 0.2279432 -0.2189163 -0.4897603 -0.3155822 0.0590808 -0.0090625 0.0936283 0.0968962 0.0287021 -0.1842002 -0.0191939 0.0690903 0.6722139 0.0908366 -0.0595386 0.3801957 0.4349431 0.0897508 -0.0653869 0.2704978 -0.0201329 0.1061034 -0.0058953 0.0256759 -0.0544204 0.153131 0.0074216 0.2375404 0.0184256 0.0960143 0.0732 0.1254917 0.0431495 0.0067519 -0.2214174 -0.0204449 0.1302851 0.0624593 0.0408633 -0.0750133 0.0206428 0.0159412 0.061282 0.0872103 0.0088031 -0.0837768 0.007048 0.0621755 0.0464637 -0.025096 -0.0373952 -0.0023624 0.072829 0.0240381 -0.0906105 -0.1041719 0.0382179 -0.9975074 -0.3120739 -0.0014784 -0.3387025 -0.2553658 0.1031205 0.0359756 0.0549094 -0.1554188 1.7945508 0.5732989 -0.1183715 0.3399071 1.2906822 0.4170477 -0.2754126 0.3575486 0.4926792 0.0325407 0.0034958 -0.0107251 0.0253518 -0.0319644 -0.1354483 0.0309909 -0.0886794 -0.0673799 0.0205966 -0.081499 0.0245171 -0.0575422 -0.0965713 0.0893303 0.0623635 0.0641282 0.0423961 -0.0013132 -0.0755318 0.0320895 -0.0439561 -0.1045821 0.0948786 0.0098424 0.0611859 0.0410451 0.0490717 0.0249284 0.0246617 0.0135491 -0.021427 -0.1373281 0.0173359 -0.105464 -0.0890989 0.0352183 0.0157388 0.0992825 -0.0019232 0.0565132 0.0407325 0.04969 0.0115145 0.0004258 -0.1022318 -0.0471353 -0.1333403 -0.0567739 0.0443552 -0.011858 -0.1202417 -0.0297736 0.020761 0.041124 -0.0429978 0.030069 -0.1120708 -0.1249342 0.077541 0.0611366 0.0644826 0.0630547 0.0658118 -0.0135324 -0.0082585 0.0231563 -0.0098738 -0.1298425 0.0644467 -0.1342283 -0.0736806 -0.102529 0.0611036 -0.099349 0.0759933 0.0684818 0.0625563 -0.1263604 0.0701561 -0.0384382 -0.0703067 0.0007223 -0.0924077 -0.0554595 0.0856333 -0.0249185 -0.0756902 -0.007448 0.0410667 -0.0340676 -0.0506419 0.1354815 0.0013659 0.0742441 0.0241681 0.1105942 0.0636741 -0.0563246 0.0988904 0.048224 0.010283 0.01404 -0.1702227 -0.0883416 0.0211531 -0.0970244 0.0198455 0.0577656 0.0217506 0.0539444 0.0334144 0.0081363 -0.0921515 0.069491 -0.0955501 0.0878733 0.1929038 0.0700148 0.0928889 0.1220387 0.3324797 -0.0623292 0.1117171 -0.0515635 0.3261835 unknown
polarizability: 126.7084609|10.6023205|97.1321067|-1.961961|7.6008386|69.9269216 unknown
InChI: InChI=1S/C8H14O2/c1-3-5-7(4-2)6-8(9)10/h6,9H,3-5H2,1-2H3
charge 0 multiplicity 1
24 atoms
O  2.76532 1.917163 0.355053
O  2.71425 -0.151106 -0.701194
C  -1.678387 0.017441 0.588404
C  -0.255765 -0.174078 0.088633
C  -2.638763 0.529374 -0.527015
C  0.013158 -1.44174 -0.704961
C  -4.093975 0.649601 -0.027481
C  0.483013 -2.597428 0.225744
C  0.69437 0.77479 0.378232
C  2.097825 0.741094 -0.058146
H  -1.703767 0.733236 1.431829
H  -2.069737 -0.950672 0.964053
H  -2.277708 1.512799 -0.884722
H  -2.598321 -0.156467 -1.395907
H  0.796693 -1.271088 -1.461499
H  -0.916226 -1.750484 -1.221484
H  -4.484524 -0.331595 0.302131
H  -4.164706 1.344922 0.830002
H  -4.758971 1.028137 -0.824847
H  1.456803 -2.347853 0.680021
H  -0.245289 -2.790278 1.03517
H  0.604137 -3.528591 -0.35614
H  0.423433 1.650679 0.977975
H  3.710738 1.862743 0.04875
