program: Gaussian 09
title: 000294874
version: EM64L-G09RevD.01
frameworkgroup: C1[X(C10H12N4O6)]
method: RPBEPBE
basis: SDD
operation: Freq
keyword: #p
keyword: freq=noraman
keyword: PBEPBE/SDD
title: #p freq=noraman PBEPBE/SDD
converged: YES YES NO NO
title: Mulliken charges:
elementType: O O O O O O N N N N C C C C C C C C C C H H H H H H H H H H H H
charge: -0.308340 -0.442312 -0.425690 -0.515608 -0.213859 -0.241988 -0.416560 -0.384503 0.022143 -0.418459 -0.194192 -0.162480 -0.197301 -0.087654 0.252290 -0.313741 0.077045 -0.083932 0.160388 0.127903 0.292712 0.251979 0.285571 0.259779 0.218885 0.231884 0.349551 0.385233 0.358265 0.378032 0.386812 0.368147
chargesum: 0.00000
title: Mulliken charges with hydrogens summed into heavy atoms:
elementType: O O O O O O N N N N C C C C C C C C C C
charge: -0.308340 -0.057079 -0.067425 -0.128796 -0.213859 -0.241988 -0.067009 -0.006471 0.022143 -0.050312 0.098520 0.089499 0.088270 0.172125 0.252290 0.137028 0.077045 -0.083932 0.160388 0.127903
polarizability: 2.01584039e+02 5.37614487e-02 1.66940843e+02 -1.21642372e+01 1.47757801e+00 9.45108486e+01
1716.lowfreq: -7.1324 0.0003 0.0005 0.0010 6.2433 8.9114 24.8663 34.0801 59.2590
frequency: 24.8115 33.9531 59.2040 79.3237 104.5214 127.4083 149.6078 163.8309 173.0517 196.2582 219.0095 257.9784 272.2044 284.7260 316.4351 323.8324 340.6257 362.5190 363.5536 374.9175 418.4569 461.2577 475.7296 517.4641 589.2948 602.7381 617.4627 643.2216 660.3130 661.2407 687.3670 698.1133 709.8418 719.3256 753.2605 757.5444 779.8012 786.3038 803.9610 850.8328 853.6865 897.2931 938.4083 958.2244 960.6614 999.1185 1021.4728 1031.0326 1036.5935 1058.4417 1075.9739 1098.7389 1142.2028 1161.0242 1184.8808 1219.9507 1226.9580 1234.0355 1242.5118 1244.6848 1267.5930 1279.3139 1301.4790 1308.3816 1327.3514 1345.4705 1349.4337 1368.8090 1377.3829 1393.6916 1411.6076 1446.2779 1460.5459 1483.9603 1498.1178 1627.3134 1661.8427 1671.2907 2981.7930 3015.6678 3025.0748 3050.5134 3061.6863 3106.0034 3180.8349 3502.2306 3526.1243 3534.8833 3596.0846 3630.1668
redmass: 6.9592 6.6214 6.6803 4.3736 6.3745 8.5241 5.6877 4.4651 5.4044 1.6181 3.2795 6.7856 6.5066 5.7328 5.0019 6.4583 5.1576 1.7222 3.4004 3.4985 6.4751 7.7559 7.1624 8.0397 6.4013 4.3550 5.0503 4.7190 1.4695 3.0720 2.6219 1.8480 1.9974 1.4485 4.5320 2.7610 3.5441 4.6684 3.5924 5.4871 4.0014 3.6923 3.5686 3.3388 3.0414 4.7226 2.7422 3.6097 5.6550 3.9788 1.6498 6.4991 1.4466 2.2323 1.6087 1.2202 1.4797 1.2899 2.7432 2.4006 1.3736 1.5161 1.5077 5.2384 1.3326 1.8770 1.4211 1.5689 1.2975 1.3202 2.4268 4.1122 1.0777 1.1396 5.5777 8.5214 10.4926 5.2354 1.0582 1.0850 1.0856 1.1070 1.0866 1.0882 1.0684 1.0664 1.0766 1.0785 1.0823 1.0672
irintensity: 2.6292 1.5533 2.6965 4.3959 1.9052 0.2736 20.2793 44.3998 2.2814 104.6242 9.4381 1.0488 1.7607 1.6586 1.7549 5.3133 8.0972 37.2351 25.2647 41.7493 5.5042 2.5189 10.5694 11.3126 7.2012 6.7147 4.9389 11.0030 52.3250 44.3759 15.6190 134.5257 35.1175 7.1745 66.3129 80.5847 51.9567 69.7693 38.8352 3.0904 11.5036 29.2075 18.8834 6.3356 22.6173 77.2591 21.2408 21.9229 131.2293 47.8721 19.2309 70.0629 7.0915 39.0341 20.9534 13.1374 8.7397 11.1357 97.7842 32.2446 24.6145 53.6697 1.0184 134.0620 10.6338 15.6677 5.7632 7.7893 9.8880 1.1523 10.7635 48.5207 12.8585 83.6229 2.4806 12.8050 453.8685 705.9742 38.8512 31.2379 9.3503 22.8097 53.9978 10.9796 397.8444 25.2788 80.7928 113.3189 107.4005 26.5509
temp: 298.150 k
press: 1.00000 atm
elementType: 8 8 8 8 8 8 7 7 7 7 6 6 6 6 6 6 6 6 6 6 1 1 1 1 1 1 1 1 1 1 1 1
symmnumber: 1
zpe: 620850.6 jmol-1
zpe.correction: 0.236470 hartree
zpe.thermalcorrener: 0.254137 hartree
zpe.thermalcorrenthalpy: 0.255081 hartree
zpe.thermalcorrgfe: 0.190195 hartree
zpe.sumelectzpe: -1057.117309 hartree
zpe.sumelectthermal: -1057.099642 hartree
zpe.sumelectthermalent: -1057.098697 hartree
zpe.sumelectthermalfe: -1057.163584 hartree
dipole: 8.0717 2.4824 -1.5130
dipole: 8.5793
quadrupole: -125.5544 -123.1315 -119.4508
quadrupole: 12.3021 -1.6250 3.2043
quadrupole: -2.8422 -0.4193 3.2614 12.3021 -1.6250 3.2043
hfenergy: -1057.3537785 hartree
pointgroup: C01 [X(C10H12N4O6)]
dipole: -3.1686478 -0.1778271 1.149344 debye
polarizability: 196.6714292|18.536201|141.8106902|-16.3780406|33.2475047|124.553612 unknown
InChI: InChI=1S/C10H12N4O6/c15-1-2-6(16)7(17)8(20-2)4-3-5(14-13-4)9(18)12-10(19)11-3/h2,6-8,11-13,15-17H,1H2
charge 0 multiplicity 1
32 atoms
O  -1.54978 0.041768 1.053961
O  -3.377233 -2.118933 -0.406652
O  -1.779514 0.818355 -2.103656
O  -4.544639 -0.27137 1.101637
O  4.704161 0.338464 -1.086919
O  2.296978 2.78783 2.101166
N  0.882579 -1.763451 -1.195958
N  1.175088 1.022672 1.047588
N  2.18914 -1.405779 -1.457417
N  3.422376 1.513688 0.480456
C  -1.171123 -1.169369 0.262791
C  -2.265219 -1.30771 -0.84266
C  -2.651983 0.180725 -1.113979
C  -2.531644 0.864012 0.275861
C  0.231403 -0.95642 -0.256014
C  -3.818422 1.013221 1.089138
C  1.207311 -0.018811 0.123478
C  2.382207 -0.321831 -0.637939
C  3.607606 0.476526 -0.489008
C  2.289081 1.839453 1.2719
H  -1.235855 -2.030981 0.951961
H  -1.882698 -1.772184 -1.766795
H  -3.661967 0.24931 -1.543971
H  -2.100332 1.875031 0.140819
H  -4.452788 1.796674 0.628445
H  -3.551626 1.311341 2.120932
H  0.498703 -2.567274 -1.69136
H  -3.934008 -1.572808 0.238011
H  -0.829526 0.714961 -1.829324
H  0.326661 1.176795 1.598618
H  -5.183299 -0.317505 1.8508
H  4.236158 2.115899 0.642988
