program: Gaussian 09
title: 000294824
version: EM64L-G09RevD.01
frameworkgroup: C1[X(C5H8O2S)]
method: RPBEPBE
basis: SDD
operation: Freq
keyword: #pfreq=noraman
keyword: PBEPBE/SDD
title: #p freq=noraman PBEPBE/SDD
converged: YES YES NO NO
title: Mulliken charges:
elementType: S O O C C C C C H H H H H H H H
charge: 0.155617 -0.273788 -0.242129 0.041770 -0.674257 -0.670017 0.295472 -0.755333 0.274512 0.275783 0.269915 0.274521 0.273780 0.250266 0.253946 0.249943
chargesum: 0.00000
title: Mulliken charges with hydrogens summed into heavy atoms:
elementType: S O O C C C C C
charge: 0.155617 -0.273788 -0.242129 0.316282 -0.128559 -0.121716 0.295472 -0.001178
polarizability: 1.02749593e+02 1.39861998e-02 6.41005649e+01 -7.13088956e-01 3.50831959e+00 6.04177870e+01
1716.lowfreq: -46.5553 -10.4508 -0.0020 0.0019 0.0031 6.8406 10.5395 28.8964 77.9625
frequency: -46.5418 18.4111 77.9213 100.3608 209.3806 296.4265 357.7532 433.5665 495.2189 571.8969 602.5757 616.7630 683.6440 815.1580 849.3117 880.5599 940.8729 998.8358 999.1978 1009.0382 1045.6042 1090.8725 1167.8209 1182.8179 1188.5077 1200.7783 1313.6720 1329.7363 1385.7026 1443.6386 1455.5850 1458.7069 1460.0221 1654.0597 3009.5292 3054.0297 3056.0114 3066.6189 3096.7592 3142.5114 3143.6813 3145.8910
redmass: 1.0718 4.4928 4.9430 3.3022 3.8463 4.7494 4.7056 2.4364 4.9207 3.3493 5.2142 5.8395 4.0514 4.5284 1.2653 4.8238 1.2920 1.7861 1.0571 3.5346 1.6359 3.3517 1.5409 3.4543 1.2364 1.3501 1.3419 1.2553 1.2213 1.0903 1.0671 1.0474 1.1179 10.7208 1.0367 1.0552 1.0581 1.0862 1.0971 1.1011 1.1117 1.1122
irintensity: 1.6551 2.1657 1.9673 1.3170 10.9034 1.6518 7.9585 0.3091 15.5870 4.2441 1.1136 0.5818 1.1047 7.7119 0.6271 58.4069 11.2070 49.5863 5.2932 159.9776 10.4263 2.1422 21.4186 393.3241 19.6040 0.9008 2.5348 2.6530 52.6295 7.4572 9.5157 17.0466 11.2996 212.9123 2.4336 36.3039 5.2150 6.4072 5.8639 7.9483 4.6492 15.4476
temp: 298.150 k
press: 1.00000 atm
elementType: 16 8 8 6 6 6 6 6 1 1 1 1 1 1 1 1
symmnumber: 1
zpe: 323287.5 jmol-1
zpe.correction: 0.123134 hartree
zpe.thermalcorrener: 0.131351 hartree
zpe.thermalcorrenthalpy: 0.132295 hartree
zpe.thermalcorrgfe: 0.088090 hartree
zpe.sumelectzpe: -743.190843 hartree
zpe.sumelectthermal: -743.182625 hartree
zpe.sumelectthermalent: -743.181681 hartree
zpe.sumelectthermalfe: -743.225886 hartree
dipole: -1.4908 -1.5513 0.9873
dipole: 2.3672
quadrupole: -58.0895 -55.9892 -53.8237
quadrupole: 4.7917 -3.9837 4.3946
quadrupole: -2.1220 -0.0217 2.1437 4.7917 -3.9837 4.3946
hfenergy: -743.3139763 hartree
pointgroup: C01 [X(C5H8O2S1)]
dipole: -0.5959556 -0.4594745 0.5486937 debye
dipolederiv: -0.3218363 -0.0109434 -0.0152715 -0.0007384 -0.1704475 -0.0178343 -0.058821 -0.0220132 -0.1467734 -1.9131616 0.0205474 -0.3563239 -0.0151994 -0.3202497 0.1092822 -0.2187667 0.1206666 -0.4781023 -0.7031545 -0.0544522 0.0233575 0.1847903 -0.4869666 0.3097227 -0.3439665 0.2641683 -0.8046636 1.0277861 0.0929076 0.0922919 0.2490062 0.1207267 0.0032795 -0.231483 -0.0127061 0.1661672 -0.0192585 0.1555861 0.011222 0.0796447 0.1544148 0.0560909 0.0158389 0.0429911 0.1585122 0.0494991 -0.1627436 -0.1027093 -0.1091121 0.1329767 -0.0494931 -0.0416193 -0.0366879 0.0788413 1.9011088 0.0453344 0.1996359 -0.270317 0.47985 -0.5059431 0.6795221 -0.4424123 1.0297976 -0.4173081 -0.1306652 0.1389165 -0.0923119 -0.0255243 0.0553543 0.0834112 0.0490625 -0.0506083 0.0418242 0.0021351 -0.0330127 -0.0424626 0.0614166 0.0348995 0.0466094 0.0332101 -0.0190424 0.0547314 -0.0934501 0.0317119 -0.0366487 -0.0320285 0.0521647 0.004715 0.0904827 -0.0060718 0.0407271 -0.0352279 -0.0223151 0.0074129 -0.0010986 -0.0902844 0.0253958 -0.1247667 -0.0402451 0.0220891 0.0818194 0.0009441 0.0143416 -0.1008105 0.0076503 -0.0043148 0.0485829 0.0868845 0.0198511 0.0411314 0.0956848 0.0160837 0.0669955 0.0299051 0.0514216 -0.0221364 -0.0780211 0.0717415 -0.0539575 -0.0380383 -0.0889143 0.0540248 -0.0511189 -0.0465008 -0.0787756 0.0190977 0.1005622 0.0356366 -0.0588831 0.0099832 0.0728872 0.0853993 -0.0186891 0.0889496 -0.0209288 0.0447982 0.066342 0.0327892 0.0944417 -0.0061666 -0.0290748 0.0572471 0.0013843 0.1051564 unknown
polarizability: 102.4265267|2.4971093|66.2242346|2.6030936|1.3160789|58.6171835 unknown
InChI: InChI=1S/C5H8O2S/c1-4(6)7-5-2-8-3-5/h5H,2-3H2,1H3
charge 0 multiplicity 1
16 atoms
S  3.141403 0.222385 0.225051
O  -0.564175 -0.453956 0.364439
O  -1.786495 0.543905 -1.366893
C  0.711812 0.013067 -0.22881
C  1.793882 -1.088535 -0.21529
C  1.450783 1.055962 0.64296
C  -1.758021 -0.123319 -0.310322
C  -2.956261 -0.685232 0.421192
H  0.514675 0.398111 -1.243731
H  1.674362 -1.79209 0.622161
H  1.97863 -1.612311 -1.163339
H  1.382336 2.105139 0.324034
H  1.23838 0.939793 1.716452
H  -3.508078 -1.364682 -0.251526
H  -2.654924 -1.225437 1.329542
H  -3.64221 0.138201 0.685483
