program: Gaussian 09
title: 000294876
version: EM64L-G09RevD.01
frameworkgroup: C1[X(C19H18N2O)]
method: RPBEPBE
basis: SDD
operation: Freq
keyword: #p
keyword: freq=noraman
keyword: PBEPBE/SDD
title: #p freq=noraman PBEPBE/SDD
converged: YES YES NO NO
title: Mulliken charges:
elementType: O N N C C C C C C C C C C C C C C C C C C C H H H H H H H H H H H H H H H H H H
charge: -0.425181 -0.239293 0.009280 0.003404 0.058368 0.156515 0.209953 0.184524 0.132046 0.361133 0.185224 -0.460008 -0.338521 -0.375655 -0.860670 -0.852806 -0.334664 -0.328651 -0.549015 -0.287572 -0.235046 -0.393139 0.249449 0.253531 0.244571 0.245938 0.238547 0.241409 0.236189 0.237793 0.239930 0.240333 0.202594 0.244052 0.225814 0.248926 0.225954 0.226611 0.237857 0.340276
chargesum: 0.00000
title: Mulliken charges with hydrogens summed into heavy atoms:
elementType: O N N C C C C C C C C C C C C C C C C C C C
charge: -0.084905 -0.239293 0.009280 0.003404 0.058368 0.156515 0.209953 0.184524 0.132046 0.361133 0.185224 0.042971 -0.093949 -0.129718 -0.144525 -0.134750 0.111983 -0.102837 -0.300089 -0.061617 -0.008435 -0.155282
polarizability: 3.71262237e+02 -3.60449499e+01 2.64378191e+02 -4.72595132e+00 -8.93180257e+00 1.03901556e+02
1716.lowfreq: -7.9926 -5.0162 0.0004 0.0004 0.0007 7.4397 36.0010 51.8492 55.4098
frequency: 35.9137 51.8390 55.3884 89.0985 106.8549 118.3050 127.0763 162.3013 173.9324 181.6069 195.1944 231.3007 279.8288 289.1619 316.0233 317.9674 327.9338 331.0491 337.4020 376.0063 396.5067 407.2126 424.4670 467.2610 472.7215 499.1041 560.2034 564.0945 589.0750 596.6792 608.9086 640.4306 667.8001 677.7104 722.0899 753.2759 755.6449 771.0477 805.3014 814.5127 816.2417 826.7618 847.3260 853.4301 902.8673 917.5075 934.7231 959.9591 968.1917 975.8025 993.8592 1015.2305 1028.7849 1030.4666 1035.6547 1039.1172 1050.6313 1064.0548 1076.4761 1089.2262 1111.5656 1149.6339 1166.2975 1186.9774 1205.5241 1231.4734 1245.9441 1281.7954 1304.6697 1306.4526 1314.3308 1328.7724 1351.4529 1362.5593 1371.5880 1386.4456 1396.2240 1400.3203 1406.7886 1412.2375 1414.6090 1431.6865 1464.2434 1465.3302 1472.0187 1475.7304 1477.3677 1478.1192 1493.8163 1498.3624 1513.6692 1568.7450 1585.5463 1593.3796 1601.0682 1623.5536 2973.2155 2975.7385 2979.2607 3017.6349 3049.6147 3064.7572 3078.0628 3098.2486 3103.6448 3116.5443 3131.1736 3135.4536 3137.5297 3145.1511 3161.0537 3166.7389 3183.9065 3566.2564
redmass: 4.5914 3.8974 5.8503 3.3705 2.5542 2.0717 1.8873 2.5112 2.4613 3.8289 1.3808 4.2436 4.9914 1.9702 4.4268 1.8314 2.8194 3.2597 3.4596 3.7775 2.8025 4.3678 3.3673 3.3253 4.8245 5.9592 3.9702 4.7868 4.2150 5.8917 4.5365 4.6850 4.8918 5.6500 3.7221 2.2882 2.0070 3.7356 1.3138 4.5740 3.1564 1.4735 3.4542 1.5062 2.7948 1.5955 1.3912 1.4201 4.4747 1.3119 3.3458 3.4010 3.0581 2.4746 1.4986 1.5733 1.6544 2.6163 1.8806 3.1491 1.9832 1.6961 1.4814 1.6045 2.1445 2.2153 1.6404 1.4954 1.2214 3.2487 1.9872 1.8857 1.5777 2.4949 2.2183 1.3336 1.3281 2.1954 1.7183 6.0303 3.0482 2.0667 2.4432 1.5749 2.3286 1.7906 1.1330 1.1697 1.0838 1.3000 1.0837 7.6368 6.6757 6.9909 7.6815 7.5391 1.0633 1.0506 1.0417 1.0643 1.0971 1.0900 1.0951 1.0996 1.0952 1.0943 1.0856 1.0865 1.0894 1.0910 1.0971 1.0961 1.0955 1.0665
irintensity: 0.5594 0.4167 3.0563 1.4526 1.1838 2.5708 0.5625 2.0574 0.6420 0.4039 1.8027 4.9030 2.8181 39.7090 1.0790 104.0684 6.2908 0.4364 21.2112 1.9967 1.4622 1.6843 1.1188 13.1676 0.1496 1.2610 0.8390 0.2697 4.3603 11.5793 2.1889 2.2740 3.1659 0.2354 14.9917 38.3477 51.2496 0.1865 8.3259 10.0257 1.3353 45.0032 2.4356 0.1380 10.5510 1.6656 1.4535 0.0206 123.6667 0.1143 15.3367 9.6822 10.2727 19.4672 4.3258 1.7263 3.9863 6.1360 12.4409 0.1490 31.0384 34.5907 8.2691 17.0121 10.2362 7.6243 33.8360 29.0551 1.0166 32.9090 2.3058 68.0424 74.4490 15.1709 21.0157 1.7549 3.6890 2.1584 9.4715 1.1622 61.2030 26.1890 85.3579 7.5004 15.0153 11.3075 8.7399 14.6717 21.7487 72.9329 12.8971 6.8168 11.0241 0.5734 122.8328 16.8035 32.3539 47.2729 18.4341 43.6249 14.4846 19.2652 0.1900 26.5079 11.3777 11.8089 1.1504 17.7773 21.6765 15.4362 29.6263 37.6930 16.5843 10.9955
temp: 298.150 k
press: 1.00000 atm
elementType: 8 7 7 6 6 6 6 6 6 6 6 6 6 6 6 6 6 6 6 6 6 6 1 1 1 1 1 1 1 1 1 1 1 1 1 1 1 1 1 1
symmnumber: 1
zpe: 848671.7 jmol-1
zpe.correction: 0.323242 hartree
zpe.thermalcorrener: 0.342079 hartree
zpe.thermalcorrenthalpy: 0.343023 hartree
zpe.thermalcorrgfe: 0.276574 hartree
zpe.sumelectzpe: -918.019509 hartree
zpe.sumelectthermal: -918.000672 hartree
zpe.sumelectthermalent: -917.999728 hartree
zpe.sumelectthermalfe: -918.066177 hartree
dipole: 2.8577 1.7462 -0.5478
dipole: 3.3934
quadrupole: -155.0252 -106.9545 -134.3959
quadrupole: -8.2568 -2.2312 -4.0918
quadrupole: -22.9000 25.1707 -2.2707 -8.2568 -2.2312 -4.0918
hfenergy: -918.3427513 hartree
pointgroup: C01 [X(C19H18N2O1)]
dipole: 1.0343118 -0.814577 0.2216081 debye
polarizability: 378.4802447|21.7982466|256.6328758|-0.6906843|-13.5150453|104.4288642 unknown
InChI: InChI=1S/C19H18N2O/c1-12-16-11-20-8-7-14(16)13(2)19-18(12)15-5-3-4-6-17(15)21(19)9-10-22/h3-8,11,22H,9-10H2,1-2H3
charge 0 multiplicity 1
40 atoms
O  3.284573 -4.212064 -0.232474
N  1.433314 -0.935848 0.258378
N  -4.883522 0.76118 0.039396
C  0.070316 -0.555783 0.152125
C  0.025784 0.894483 -0.006101
C  1.411052 1.370792 -0.024167
C  2.243861 0.215729 0.140814
C  -1.094363 -1.347564 0.164253
C  -1.19361 1.585527 -0.111419
C  -2.348454 -0.639636 0.12252
C  -2.405832 0.813458 -0.014252
C  2.017986 -2.240888 0.595287
C  2.026217 2.642099 -0.143094
C  3.650969 0.300439 0.18924
C  -1.091408 -2.869412 0.180046
C  -1.191559 3.089806 -0.312255
C  2.528589 -3.022494 -0.641709
C  -3.611723 -1.322194 0.220683
C  -3.71234 1.420169 -0.04953
C  3.434474 2.738529 -0.098073
C  4.236851 1.579774 0.067225
C  -4.810874 -0.615142 0.177206
H  2.879319 -2.077844 1.269316
H  1.287566 -2.84151 1.160472
H  1.431399 3.549819 -0.264439
H  4.281608 -0.58607 0.309938
H  -1.15136 -3.28609 1.204888
H  -1.954188 -3.265978 -0.380508
H  -0.195076 -3.28309 -0.306763
H  -2.197142 3.512423 -0.445363
H  -0.728405 3.603654 0.551774
H  -0.601669 3.360345 -1.207726
H  1.691149 -3.281983 -1.322544
H  3.249859 -2.41005 -1.206049
H  -3.649602 -2.406788 0.351752
H  -3.806797 2.506304 -0.147352
H  3.913667 3.718693 -0.192194
H  5.327816 1.675757 0.097943
H  -5.774097 -1.130378 0.25796
H  2.664749 -4.891878 0.133901
