program: Gaussian 09
title: 000294830
version: EM64L-G09RevD.01
frameworkgroup: C1[X(C12H14N2O2)]
method: RPBEPBE
basis: SDD
operation: Freq
keyword: #p
keyword: freq=noraman
keyword: PBEPBE/SDD
title: #p freq=noraman PBEPBE/SDD
converged: YES YES NO NO
title: Mulliken charges:
elementType: O O N N C C C C C C C C C C C C H H H H H H H H H H H H H H
charge: -0.238808 -0.288179 -0.157987 -0.340450 0.361242 -0.601000 -0.705896 -0.725044 0.174421 0.160271 0.221263 -0.358355 -0.375723 -0.222131 -0.228337 -0.224819 0.256079 0.263253 0.221828 0.218805 0.268893 0.217190 0.276185 0.217499 0.361448 0.268189 0.274321 0.234787 0.235343 0.235711
chargesum: 0.00000
title: Mulliken charges with hydrogens summed into heavy atoms:
elementType: O O N N C C C C C C C C C C C C
charge: -0.238808 -0.288179 -0.157987 0.020998 0.361242 -0.081668 0.003630 -0.014170 0.174421 0.160271 0.221263 -0.090166 -0.101402 0.012656 0.007006 0.010892
polarizability: 2.01015673e+02 2.35135188e+00 1.49719982e+02 6.59128673e+00 1.16094755e+01 9.86382973e+01
1716.lowfreq: -8.3113 0.0006 0.0007 0.0008 4.1955 10.2877 47.3676 52.9891 73.9952
frequency: 47.3552 52.9551 73.9937 82.9256 120.9547 184.7154 195.9271 223.0974 238.5123 242.1173 272.2088 310.5005 327.1341 360.0455 378.9559 402.9080 438.1987 443.4432 473.0699 491.4016 538.4301 567.8893 578.5834 613.4959 659.7487 676.1430 707.5062 730.5020 788.0586 822.2125 864.3964 869.2644 887.2168 920.8600 942.8310 946.0489 970.8056 987.5638 989.3186 1004.3838 1016.9836 1026.1972 1083.7915 1108.1242 1122.9429 1155.7450 1173.6508 1175.6440 1190.5528 1232.6830 1248.1493 1266.2378 1287.4594 1311.0760 1320.8230 1375.6552 1380.6257 1391.8360 1432.8157 1433.1058 1449.0537 1457.2283 1471.2667 1479.3570 1481.1056 1496.5805 1544.6466 1589.2372 1608.6212 1663.8245 2986.5164 2992.7585 3017.9936 3080.3681 3085.7864 3098.9181 3108.9420 3121.2437 3128.3130 3136.1035 3148.1282 3159.6053 3171.0965 3561.5630
redmass: 3.9583 3.9055 3.4026 5.9525 7.0156 4.1689 4.7939 3.5031 1.2549 3.8192 1.0755 2.7570 2.8837 5.3073 3.6954 2.6024 1.6822 3.2586 2.6955 3.9252 2.9780 3.0987 4.8376 6.3925 5.8107 5.9096 1.7792 3.9389 2.2413 4.9765 1.2484 3.2837 2.9801 1.9927 1.4132 1.4078 1.7811 1.4225 5.4292 1.3297 1.3714 2.3074 1.5916 1.4933 3.5021 3.4731 2.1956 1.1311 1.1201 1.8755 2.5667 4.4208 2.0286 1.8254 1.4550 1.2062 8.2527 1.2218 3.2714 2.2718 1.0976 1.0625 1.1122 1.2449 1.7351 1.0707 6.9180 6.2401 5.9852 9.0334 1.0357 1.0371 1.0650 1.1003 1.0996 1.0986 1.1002 1.0990 1.0859 1.0882 1.0925 1.0961 1.1012 1.0807
irintensity: 0.3052 1.2877 0.2895 2.5935 4.6257 1.8438 10.0797 1.3186 1.1837 0.6311 0.0104 2.8887 3.7982 3.0819 16.1534 4.2644 40.6859 6.6668 29.8450 4.0055 27.9070 27.7330 2.0696 0.4931 29.2051 25.2366 58.4287 14.2488 41.9286 5.8966 2.2151 10.7605 1.4342 5.5129 2.8853 1.5165 0.3294 2.1944 1.9740 0.2810 1.9258 8.7139 14.2314 7.8085 11.5491 6.9871 1.9359 0.6432 11.3572 1.9914 94.8488 313.3500 12.7495 130.6330 42.9610 32.5187 0.7147 47.7697 29.0616 5.8933 10.6643 7.2598 42.5580 7.0167 1.7059 15.9519 195.8256 12.1849 2.5867 482.4933 21.8246 19.9451 13.3190 14.8437 40.5414 6.2165 8.1104 6.8635 1.6627 2.1662 16.1299 16.8422 19.1486 64.6721
temp: 298.150 k
press: 1.00000 atm
elementType: 8 8 7 7 6 6 6 6 6 6 6 6 6 6 6 6 1 1 1 1 1 1 1 1 1 1 1 1 1 1
symmnumber: 1
zpe: 629224.0 jmol-1
zpe.correction: 0.239659 hartree
zpe.thermalcorrener: 0.254509 hartree
zpe.thermalcorrenthalpy: 0.255454 hartree
zpe.thermalcorrgfe: 0.197810 hartree
zpe.sumelectzpe: -724.450709 hartree
zpe.sumelectthermal: -724.435859 hartree
zpe.sumelectthermalent: -724.434914 hartree
zpe.sumelectthermalfe: -724.492558 hartree
dipole: -1.2229 -0.4872 0.4365
dipole: 1.3869
quadrupole: -78.7001 -113.1508 -92.4446
quadrupole: -14.1258 4.8726 7.1812
quadrupole: 16.0651 -18.3856 2.3206 -14.1258 4.8726 7.1812
hfenergy: -724.690368 hartree
pointgroup: C01 [X(C12H14N2O2)]
dipole: 0.4899477 -0.2334397 -0.056457 debye
polarizability: 199.6740643|3.1101857|134.5833295|12.9651722|-25.7937071|115.1165583 unknown
InChI: InChI=1S/C12H14N2O2/c1-12(2)8-10(15)13-14(12)11(16)9-6-4-3-5-7-9/h3-7,13H,8H2,1-2H3
charge 0 multiplicity 1
30 atoms
O  -2.447319 2.927286 -0.749976
O  0.016192 -2.157567 0.766905
N  -0.950828 -0.232652 -0.084126
N  -0.955905 1.186877 -0.23659
C  -2.39765 -0.706039 -0.048228
C  -3.136499 0.498537 -0.710616
C  -2.832149 -0.890058 1.427063
C  -2.561149 -2.007189 -0.85808
C  -2.195514 1.704815 -0.580226
C  0.154835 -0.971891 0.31435
C  1.515574 -0.335468 0.180615
C  2.480766 -0.642061 1.174037
C  1.893618 0.456813 -0.937228
C  3.792438 -0.133134 1.073808
C  3.212206 0.952467 -1.042436
C  4.160738 0.668885 -0.03271
H  -4.098573 0.718491 -0.222048
H  -3.333835 0.31937 -1.78362
H  -2.731862 0.055675 1.990434
H  -3.890277 -1.205481 1.46609
H  -2.212533 -1.662691 1.910073
H  -2.19434 -1.875525 -1.891698
H  -2.004774 -2.832467 -0.387926
H  -3.632879 -2.273113 -0.9011
H  -0.112407 1.725044 -0.032999
H  2.188384 -1.292461 2.004754
H  1.175644 0.655269 -1.741347
H  4.528515 -0.367051 1.85047
H  3.499708 1.550585 -1.913904
H  5.181275 1.058936 -0.113544
