program: Gaussian 09
title: 000027442
version: EM64L-G09RevD.01
frameworkgroup: C1[X(C22H28N2)]
method: RPBEPBE
basis: SDD
operation: Freq
keyword: #pfreq=noraman
keyword: PBEPBE/SDD
title: #p freq=noraman PBEPBE/SDD
converged: NO YES NO NO
title: Mulliken charges:
elementType: N N C C C C C C C C C C C C C C C C C C C C C C H H H H H H H H H H H H H H H H H H H H H H H H H H H H
charge: -0.072685 -0.487313 0.311729 -0.145750 -0.157721 -0.515073 -0.501854 -0.475382 0.147562 -0.565379 -0.408069 0.138750 -0.425722 -0.390042 -0.402506 -0.155872 -0.477260 -0.535405 0.146943 0.187482 -0.431189 -0.381593 -0.257257 -0.226993 0.221510 0.233678 0.220890 0.193568 0.215228 0.173101 0.232887 0.189765 0.218301 0.217778 0.213418 0.203320 0.197948 0.205824 0.185440 0.202607 0.201210 0.189297 0.247716 0.232236 0.229935 0.238864 0.221675 0.302323 0.230858 0.227387 0.216240 0.217595
chargesum: 0.00000
title: Mulliken charges with hydrogens summed into heavy atoms:
elementType: N N C C C C C C C C C C C C C C C C C C C C C C
charge: -0.072685 -0.184990 0.311729 0.075759 0.075957 -0.100615 -0.113524 -0.052730 0.147562 -0.129300 0.008669 0.138750 -0.021950 -0.001995 -0.011998 0.091844 -0.015089 -0.074866 0.146943 0.187482 -0.200331 -0.154206 -0.041017 -0.009398
polarizability: 3.05883255e+02 -2.02605449e+01 2.52323816e+02 7.65990709e+00 1.53701318e+01 1.71769064e+02
1716.lowfreq: -15.5848 -3.9359 -0.0007 -0.0004 0.0003 6.5635 26.5508 37.3229 52.0290
frequency: 26.3860 37.1124 51.9304 76.6681 116.9110 124.0953 139.5379 140.8098 174.9004 187.3101 227.9760 233.9469 261.0125 282.9908 290.5101 295.0372 311.1019 327.2154 351.0605 371.3148 390.9019 410.5821 447.1036 455.9281 468.1777 491.9785 501.7329 520.4854 537.1174 550.8566 569.0725 579.3646 607.9036 653.5565 684.7709 690.8286 709.1801 746.7138 755.2350 767.6013 773.0842 787.4858 792.3476 796.1708 825.0927 835.2358 847.3949 849.9058 873.8132 881.4952 896.2683 912.1619 922.2324 925.6985 932.0731 944.4292 962.7891 966.3566 976.7284 988.3154 989.7584 1010.9423 1017.2722 1032.8350 1053.2073 1058.1626 1072.4507 1081.5113 1088.9446 1099.6699 1108.7391 1110.5887 1113.5311 1125.6644 1141.4332 1146.3421 1161.2546 1164.5593 1168.6560 1182.2677 1193.4183 1201.6547 1215.3868 1216.8500 1226.4592 1233.4342 1245.8839 1252.4020 1256.4471 1273.5649 1280.9475 1300.5317 1306.6712 1307.7411 1321.2492 1328.1490 1332.0845 1334.6713 1339.9674 1341.6979 1350.1843 1354.4879 1361.2704 1378.9819 1404.5795 1407.3941 1435.3198 1444.6539 1453.2605 1455.0096 1457.8165 1466.0533 1467.2405 1468.3390 1470.1924 1476.3365 1478.8077 1484.8671 1490.7735 1575.4490 1588.3406 1629.7986 2833.0339 2875.7772 2946.0388 2946.9861 2958.3983 2960.8422 2979.0609 2980.1597 2984.3229 2986.1567 2987.5006 3000.1977 3005.7019 3013.6761 3023.9385 3036.1740 3045.4328 3054.0650 3090.2831 3099.2529 3109.3223 3118.7286 3126.0760 3140.3290 3158.9065 3187.7205 3207.7106 3608.4570
redmass: 4.4071 3.5912 3.3978 3.7616 3.1842 2.9160 3.0260 3.3445 2.9184 3.5765 2.7039 3.1677 3.6780 2.7893 3.2348 2.3727 2.3279 2.2362 3.1412 2.9745 2.9257 2.8700 2.9590 3.0407 2.2374 3.5785 1.1668 3.6817 3.0534 3.6552 4.1352 3.5344 3.6387 3.5640 4.1612 4.5899 3.3799 1.3416 3.9324 1.4080 1.8979 2.8525 2.0775 2.1294 1.3981 2.2274 1.6037 2.1871 2.8694 2.7476 1.7947 1.7735 2.4902 1.4331 2.2961 1.9509 2.3013 1.2981 2.5488 2.4729 2.1918 2.0201 1.7811 1.2476 1.9529 1.2737 1.9886 2.1178 2.1276 2.2910 1.1629 2.3652 1.9558 1.6492 1.6434 2.6926 1.3717 1.1738 1.5007 2.2872 1.8906 1.4858 1.5907 1.5164 1.7428 1.5360 1.3485 1.4381 1.4897 1.4404 1.4850 1.6168 1.3477 2.0373 1.4298 1.3873 1.4382 1.4904 1.4026 1.4882 1.5698 1.4304 1.8235 1.4993 1.6493 3.9574 3.0047 1.0882 1.1462 1.1112 1.0940 1.0964 1.2400 3.8711 1.1107 1.1783 2.9214 1.1000 1.0899 7.0063 6.5437 7.1618 1.0712 1.0704 1.0602 1.0614 1.0819 1.0638 1.0640 1.0634 1.0669 1.0952 1.0884 1.0842 1.0975 1.0854 1.0957 1.1021 1.1005 1.0988 1.0519 1.0645 1.0872 1.0846 1.0889 1.0949 1.1000 1.1169 1.1148 1.0799
irintensity: 0.0954 0.0602 0.0498 0.0670 1.2741 0.0528 1.3484 0.3725 0.1694 1.3918 1.2000 0.8204 0.9740 0.3970 1.5542 0.5167 0.4334 0.9910 2.2462 2.5620 1.4456 3.6800 2.9613 1.8192 0.7877 3.8193 68.9372 6.3560 5.8134 1.1085 0.8428 2.7416 0.9869 1.2154 1.8332 10.9470 7.9373 96.2887 2.4539 1.6130 3.7936 2.9594 2.7068 9.6881 9.1461 3.1399 1.9532 7.6137 3.8767 2.0799 1.7436 2.1208 3.3292 2.9177 7.7370 3.8756 6.5389 0.0609 20.2078 16.3256 7.2078 7.1768 10.9234 31.1655 1.6537 15.1566 1.8148 3.0997 9.7780 8.0140 1.5000 11.0615 23.4084 2.9786 2.9169 14.1396 1.5909 1.4380 0.4188 12.7839 13.1185 2.6121 7.7929 7.3019 11.2176 2.1222 2.4990 21.1913 1.8126 9.9884 9.2221 18.5254 6.0666 17.0954 3.5692 7.7212 25.6442 14.6314 0.7346 18.5286 7.9376 3.3561 4.8779 8.0297 9.1397 18.0195 16.6042 8.2917 5.8968 1.5907 5.6180 8.6859 1.5068 46.8900 7.8456 1.1749 0.8183 13.3478 11.0064 2.0408 7.6737 0.5055 81.7331 91.1854 44.9433 38.5579 22.6334 44.6235 11.6956 53.0236 29.9622 44.7881 10.2615 66.4304 52.9019 38.3564 84.3500 34.2653 43.6512 80.9278 29.2454 20.4957 9.4048 2.2076 3.9793 38.3435 40.5005 1.8454 30.9608 38.9164
temp: 298.150 k
press: 1.00000 atm
elementType: 7 7 6 6 6 6 6 6 6 6 6 6 6 6 6 6 6 6 6 6 6 6 6 6 1 1 1 1 1 1 1 1 1 1 1 1 1 1 1 1 1 1 1 1 1 1 1 1 1 1 1 1
symmnumber: 1
zpe: 1185836.6 jmol-1
zpe.correction: 0.451661 hartree
zpe.thermalcorrener: 0.471820 hartree
zpe.thermalcorrenthalpy: 0.472764 hartree
zpe.thermalcorrgfe: 0.403612 hartree
zpe.sumelectzpe: -962.844683 hartree
zpe.sumelectthermal: -962.824524 hartree
zpe.sumelectthermalent: -962.823580 hartree
zpe.sumelectthermalfe: -962.892732 hartree
dipole: -0.9574 1.7121 0.5900
dipole: 2.0484
quadrupole: -147.0062 -135.9604 -142.5780
quadrupole: 6.9793 4.3400 5.1228
quadrupole: -5.1580 5.8878 -0.7298 6.9793 4.3400 5.1228
hfenergy: -963.2963441 hartree
pointgroup: C01 [X(C22H28N2)]
dipole: -0.407148 0.6572147 0.2275864 debye
polarizability: 307.4149967|-17.9788259|250.7431127|8.0703332|15.3791291|171.818026 unknown
InChI: InChI=1S/C22H28N2/c1-2-7-19-16(5-1)17-13-20-18-6-3-4-10-22(18,21(17)23-19)11-12-24(20)14-15-8-9-15/h1-2,5,7,15,18,20,23H,3-4,6,8-14H2
charge 0 multiplicity 1
52 atoms
N  -1.99595 -0.664864 0.659705
N  2.352844 1.244754 0.531457
C  -0.201262 1.632923 0.260679
C  -1.163759 1.111923 -0.86368
C  -1.382613 -0.415019 -0.677298
C  -0.82826 1.305084 1.658153
C  0.036376 3.162705 0.092459
C  -2.481784 1.914907 -0.931167
C  1.076383 0.835982 0.101797
C  -0.044136 -1.191063 -0.96258
C  -1.174169 -0.191187 1.802179
C  1.161108 -0.450387 -0.431047
C  -1.280388 3.973926 0.006055
C  -2.489766 -2.047262 0.881924
C  -2.208212 3.427712 -1.105899
C  -3.416234 -2.564054 -0.211411
C  -4.811971 -1.949729 -0.379876
C  -4.663728 -3.373749 0.18032
C  2.549606 -0.860015 -0.347591
C  3.278313 0.22766 0.261426
C  3.256719 -2.034506 -0.717262
C  4.668641 0.168094 0.494331
C  4.645284 -2.100838 -0.483751
C  5.344494 -1.011379 0.114601
H  -0.63576 1.249876 -1.831997
H  -2.131196 -0.742226 -1.4226
H  -1.747784 1.900315 1.801176
H  -0.119048 1.593403 2.459189
H  0.619197 3.32769 -0.837176
H  0.650324 3.547955 0.934771
H  -3.079966 1.72707 -0.020427
H  -3.086149 1.540644 -1.781946
H  0.051292 -1.340862 -2.058996
H  -0.10517 -2.209187 -0.525185
H  -0.23571 -0.786719 1.920575
H  -1.765418 -0.339616 2.727543
H  -1.04268 5.03844 -0.185474
H  -1.810781 3.940604 0.977993
H  -1.648816 -2.777948 1.0112
H  -3.039782 -2.038099 1.844754
H  -3.16178 3.990702 -1.112642
H  -1.728287 3.599895 -2.092295
H  -2.917353 -2.890624 -1.131797
H  -5.084964 -1.148496 0.313143
H  -5.214994 -1.83038 -1.389968
H  -4.957863 -4.213982 -0.455468
H  -4.859844 -3.528476 1.24638
H  2.572424 2.155413 0.928144
H  2.73153 -2.87824 -1.179795
H  5.210959 1.001714 0.955401
H  5.201594 -3.002248 -0.765075
H  6.424289 -1.092435 0.28345
