program: Gaussian 09
title: 000294859
version: EM64L-G09RevD.01
frameworkgroup: C1[X(C15H34N2)]
method: RPBEPBE
basis: SDD
operation: Freq
keyword: #pfreq=noraman
keyword: PBEPBE/SDD
title: #p freq=noraman PBEPBE/SDD
converged: YES YES NO NO
title: Mulliken charges:
elementType: N N C C C C C C C C C C C C C C C H H H H H H H H H H H H H H H H H H H H H H H H H H H H H H H H H H
charge: -0.347181 -0.571332 0.340661 -0.494382 -0.435999 0.336915 0.294017 -0.770568 -0.758691 -0.751861 -0.742380 -0.728514 -0.737887 -0.735822 -0.365892 -0.395558 -0.369610 0.194383 0.184077 0.257846 0.162330 0.238716 0.198814 0.202698 0.204818 0.204565 0.237732 0.231088 0.218267 0.207965 0.227343 0.208730 0.215562 0.221390 0.211800 0.204311 0.202655 0.208562 0.207907 0.216960 0.236924 0.206966 0.201572 0.202903 0.189558 0.174621 0.219385 0.198210 0.210181 0.269654 0.255593
chargesum: 0.00000
title: Mulliken charges with hydrogens summed into heavy atoms:
elementType: N N C C C C C C C C C C C C C C C
charge: -0.116092 -0.046085 0.340661 -0.115923 -0.015823 0.336915 0.294017 -0.130341 -0.111575 -0.098286 -0.096698 -0.109748 -0.104458 -0.090361 0.026568 -0.001553 0.038782
polarizability: 1.89701679e+02 2.30204607e-01 1.91437426e+02 -5.90472086e-01 -2.05129076e-01 1.55660825e+02
1716.lowfreq: -14.6375 -10.9812 -8.3204 -0.0005 -0.0004 0.0002 13.5103 28.6893 37.2079
frequency: 12.0177 27.4317 37.1228 56.8498 71.8824 85.3962 106.7012 138.5938 154.5710 191.5476 203.1603 206.7472 218.9136 221.7179 238.3204 243.0539 251.1698 258.1641 260.6187 273.8275 286.3109 296.5801 307.7227 312.0024 316.1449 333.6484 362.9520 369.0998 377.7516 403.9758 415.7505 424.9684 439.5493 449.3789 502.9780 566.1701 588.3995 615.9620 630.7194 715.7172 747.9633 766.6170 793.8268 844.1610 851.0176 857.2335 861.2305 899.8103 907.4501 919.8652 923.2051 923.7925 936.5217 957.3595 968.6277 980.2581 980.9146 987.1603 998.0759 1012.7882 1023.1725 1031.3406 1066.9983 1093.3058 1100.4651 1112.3046 1127.7874 1144.5101 1160.6556 1170.6246 1214.5447 1220.8431 1223.9257 1232.0131 1240.2653 1250.2502 1258.3362 1287.9413 1309.7863 1333.7267 1337.7414 1343.8380 1347.1560 1354.8650 1365.9425 1368.0123 1370.8662 1373.2005 1384.6712 1388.3387 1393.5152 1398.6874 1430.5457 1449.8390 1454.8680 1456.0962 1459.8509 1463.3053 1466.9949 1467.3680 1468.9519 1471.6337 1475.0858 1480.3498 1482.3761 1484.5372 1487.9055 1491.8353 1495.0514 1499.1034 1500.2163 1507.0772 1638.7365 2873.7713 2913.3995 2928.6302 2936.3451 2953.1789 2957.6776 2964.4735 2966.0638 2966.9863 2970.9964 2976.7258 2984.3958 2998.2975 3006.8732 3016.4673 3019.0000 3045.7788 3049.3705 3050.8708 3052.2138 3056.7228 3057.4311 3061.4967 3062.5686 3067.4196 3073.6957 3074.0967 3091.5144 3097.0069 3097.9399 3108.6579 3414.2952 3441.0937 3567.3909
redmass: 3.1485 2.6861 3.8731 2.6615 2.1811 3.1584 2.3314 2.2791 2.4509 2.0727 1.2007 2.1754 1.4900 1.2722 1.3220 1.1595 1.8812 2.1026 1.9490 2.0161 1.8530 1.1488 1.1395 1.5619 1.9418 2.0553 2.0662 2.3258 2.1524 1.8992 2.1648 2.0845 2.2874 1.9801 2.7605 2.3472 2.8580 1.5185 1.2981 3.5527 2.7767 2.7139 1.3840 1.9595 1.9747 1.9901 1.8975 1.8542 1.7097 1.6515 1.6794 1.4496 1.2184 1.8024 1.7517 1.7112 2.0440 1.3771 1.3327 1.3206 1.4072 1.4222 3.2996 1.8646 2.3783 2.3287 1.7959 1.9038 1.7545 2.1512 2.1552 2.2190 2.5317 1.6318 2.3219 3.1806 1.7830 1.1086 1.4577 1.3559 1.3725 1.3494 1.3327 1.3166 1.2055 1.2038 1.2175 1.2047 1.2787 1.3744 1.2197 1.2143 1.1369 1.0855 1.0592 1.0618 1.0575 1.0502 1.0713 1.0523 1.0651 1.0614 1.0602 1.1019 1.0661 1.0735 1.0534 1.0690 1.0807 1.0607 1.0638 1.0584 1.0930 1.0707 1.0678 1.0632 1.0649 1.0672 1.0346 1.0359 1.0353 1.0375 1.0374 1.0399 1.0367 1.0955 1.0893 1.0861 1.0937 1.0971 1.0994 1.0989 1.0991 1.0991 1.0966 1.0982 1.0995 1.0992 1.0984 1.0985 1.0963 1.0963 1.0997 1.0956 1.0738 1.0449 1.0968
irintensity: 0.2775 1.1400 0.6229 0.1616 3.5509 1.3893 0.4784 1.5593 4.6725 1.9488 0.0864 5.7101 12.5703 13.5304 5.3779 0.5959 1.4719 0.2300 7.8234 5.3677 0.9381 1.1024 0.0331 5.9104 3.2258 0.8882 0.0521 1.8252 0.0914 0.9875 1.6377 5.8256 0.9413 1.3399 8.5645 9.6711 5.3445 98.0960 272.0229 0.2252 3.6704 2.0491 3.9056 0.5113 0.9950 2.6589 1.1741 1.8046 3.3297 0.5386 1.5243 2.4710 0.3994 14.6137 4.3709 3.5145 3.7623 3.5571 0.4320 0.5027 0.2533 0.9558 9.0918 4.1040 19.2989 9.7398 5.1759 39.6317 4.7903 16.7500 7.7972 14.5606 27.2371 6.8388 35.5762 23.5440 7.4199 0.6255 2.2799 1.4489 2.2755 15.8354 5.3613 6.0532 21.3050 8.6571 19.7995 25.1207 30.4073 0.9342 21.4003 13.4426 22.6200 3.9155 3.8038 5.5118 2.8573 0.7755 7.3356 7.0470 1.0826 2.4405 23.8195 3.7776 7.6607 0.2620 3.4504 1.5898 3.8525 23.6807 29.0071 11.5818 35.7998 113.2797 117.6325 22.1448 41.8715 32.3250 38.8915 40.1766 22.6930 67.2196 21.5828 28.5544 15.8385 29.4521 23.5511 37.1980 15.2319 77.8272 15.9034 20.2696 11.6924 49.7317 56.9806 129.8627 46.0508 2.6115 72.0893 62.7618 36.8822 30.2143 42.0389 23.7471 2.8617 2.2028 0.0329
temp: 298.150 k
press: 1.00000 atm
elementType: 7 7 6 6 6 6 6 6 6 6 6 6 6 6 6 6 6 1 1 1 1 1 1 1 1 1 1 1 1 1 1 1 1 1 1 1 1 1 1 1 1 1 1 1 1 1 1 1 1 1 1
symmnumber: 1
zpe: 1227103.4 jmol-1
zpe.correction: 0.467379 hartree
zpe.thermalcorrener: 0.490460 hartree
zpe.thermalcorrenthalpy: 0.491405 hartree
zpe.thermalcorrgfe: 0.415580 hartree
zpe.sumelectzpe: -700.010304 hartree
zpe.sumelectthermal: -699.987222 hartree
zpe.sumelectthermalent: -699.986278 hartree
zpe.sumelectthermalfe: -700.062102 hartree
dipole: 0.5603 -0.5926 -0.6059
dipole: 1.0160
quadrupole: -122.2993 -109.0130 -109.4179
quadrupole: 3.9437 0.9575 -0.6321
quadrupole: -8.7226 4.5637 4.1589 3.9437 0.9575 -0.6321
hfenergy: -700.4776829 hartree
pointgroup: C01 [X(C15H34N2)]
dipole: 0.2089244 0.2639157 0.2155983 debye
polarizability: 189.7009645|-0.4831533|191.3127736|-1.668194|-1.3768642|155.7861923 unknown
InChI: InChI=1S/C15H34N2/c1-13(2,3)11-14(4,5)12-15(6,7)17-10-8-9-16/h17H,8-12,16H2,1-7H3
charge 0 multiplicity 1
51 atoms
N  -1.665073 0.644724 0.465895
N  -3.127233 -3.531118 0.569158
C  1.643799 1.224691 0.156012
C  0.368786 2.078124 0.532635
C  1.321497 -0.302645 0.323503
C  -1.059557 1.896094 -0.096067
C  2.252106 -1.460973 -0.189851
C  2.167593 1.614562 -1.254952
C  2.724936 1.680349 1.187547
C  -1.053391 1.801223 -1.642997
C  -1.877494 3.168025 0.311216
C  3.747364 -1.310025 0.198536
C  1.716999 -2.763901 0.478739
C  2.141569 -1.652434 -1.729804
C  -3.081001 0.323995 0.172841
C  -3.452008 -1.07501 0.712143
C  -2.736927 -2.228919 -0.019191
H  0.651509 3.13815 0.364125
H  0.227609 1.982349 1.633482
H  0.321708 -0.480279 -0.116023
H  1.182689 -0.462101 1.416354
H  1.519269 1.251504 -2.066872
H  2.238827 2.71662 -1.342709
H  3.180805 1.207033 -1.424483
H  2.432835 1.400877 2.218016
H  2.850084 2.780865 1.158379
H  3.708074 1.228198 0.979676
H  -1.479202 0.577489 1.477459
H  -0.458787 2.621239 -2.081814
H  -2.079979 1.885088 -2.044838
H  -0.633541 0.836973 -1.975378
H  -1.859274 3.313636 1.408454
H  -1.460204 4.076609 -0.161776
H  -2.932227 3.080122 -0.007035
H  3.86752 -1.148153 1.286068
H  4.229216 -0.468228 -0.330309
H  4.302362 -2.230252 -0.06934
H  1.833812 -2.723703 1.578622
H  2.265603 -3.651204 0.108633
H  0.641955 -2.909015 0.256718
H  2.564296 -0.801884 -2.289378
H  1.084207 -1.771221 -2.035541
H  2.688686 -2.56344 -2.041654
H  -3.225384 0.332926 -0.924505
H  -3.800416 1.067487 0.595223
H  -3.213508 -1.122878 1.797745
H  -4.544451 -1.228221 0.624797
H  -3.054796 -2.226682 -1.080369
H  -1.640626 -2.028784 -0.007817
H  -2.811095 -4.344679 0.030994
H  -2.874039 -3.619199 1.559933
