program: Gaussian 09
title: 000294814
version: EM64L-G09RevD.01
frameworkgroup: C1[X(C13H16ClNO2)]
method: RPBEPBE
basis: SDD
operation: Freq
keyword: #p
keyword: freq=noraman
keyword: PBEPBE/SDD
title: #p freq=noraman PBEPBE/SDD
converged: YES YES NO NO
title: Mulliken charges:
elementType: Cl O O N C C C C C C C C C C C C C H H H H H H H H H H H H H H H H
charge: -0.073770 -0.419979 -0.227775 -0.142537 -0.460315 -0.367459 -0.534197 0.453554 -0.454093 -0.354009 -0.355785 0.196567 0.174492 -0.230223 -0.242708 -0.269071 -0.590163 0.238415 0.225662 0.219582 0.245696 0.236029 0.246471 0.266766 0.238389 0.223660 0.233649 0.218342 0.220493 0.226408 0.253225 0.226242 0.378445
chargesum: 0.00000
title: Mulliken charges with hydrogens summed into heavy atoms:
elementType: Cl O O N C C C C C C C C C C C C C
charge: -0.073770 -0.041535 -0.227775 -0.142537 0.003762 0.097819 -0.051697 0.453554 0.051061 -0.130349 -0.122136 0.196567 0.174492 -0.011882 -0.022215 -0.042662 -0.110697
polarizability: 1.59753929e+02 9.56122472e+00 1.73333142e+02 2.40925587e+01 -7.37403420e+00 1.48250672e+02
1716.lowfreq: -6.0833 -4.7417 -0.0029 -0.0028 -0.0015 5.4376 19.2609 23.0259 29.7523
frequency: 19.2599 22.9521 29.7319 36.6025 61.7118 79.8434 83.7100 97.4153 153.8014 155.2408 184.4220 248.7366 293.8241 333.3213 360.8657 399.5333 414.4595 424.0849 430.4933 460.2307 504.6617 508.1465 531.1721 569.4118 587.2961 613.8724 617.1591 640.4108 677.3593 692.9142 732.6867 755.0436 778.3282 810.7449 837.5467 870.2883 880.3022 895.7865 910.0243 918.1630 955.1916 975.9780 976.9646 992.0514 998.1456 1033.5695 1049.6327 1078.7399 1093.4986 1106.1202 1141.2799 1167.3952 1173.4938 1181.2619 1205.8590 1232.3107 1246.6621 1271.5543 1280.5394 1320.3301 1335.6395 1340.4312 1352.8575 1374.5479 1381.9439 1384.7345 1405.1775 1438.5564 1447.0466 1459.7527 1465.0842 1489.6280 1503.8410 1580.4798 1620.2977 1653.5313 1670.1844 2972.1962 2986.1241 2990.3539 3008.0166 3036.1670 3039.5628 3050.6410 3076.7321 3106.2697 3123.5312 3130.5989 3158.2222 3169.0333 3177.5691 3222.5076 3513.5837
redmass: 11.9651 6.9038 7.8658 5.3477 3.7924 6.1160 3.0804 2.3948 4.3533 5.7640 3.9825 4.5845 4.7640 2.7441 3.3971 2.9078 3.2392 3.2988 3.9245 3.2067 2.6834 1.7971 2.8242 4.1325 4.4427 5.0353 4.5495 1.3314 1.1843 1.7811 2.4883 1.9788 1.7755 1.2640 2.3002 1.4926 2.3949 2.4038 1.9828 1.4341 1.3684 1.5038 3.3784 2.1024 3.3311 2.2231 2.3240 2.2753 1.7199 2.2864 2.4896 1.4215 1.1573 1.7534 1.1247 1.4778 1.5620 1.3695 1.2320 1.5698 1.2777 1.3559 1.4251 1.6969 6.2462 1.5977 1.1566 1.0993 1.7884 1.2756 1.1216 1.3299 1.7857 6.0281 6.0344 5.9082 8.2438 1.0631 1.0609 1.0633 1.0626 1.0968 1.0985 1.0993 1.1007 1.0642 1.0848 1.0896 1.0938 1.0934 1.0964 1.1136 1.0640
irintensity: 0.9346 0.0669 0.8429 0.6408 0.3682 1.3595 0.3922 1.1618 1.0120 3.9523 0.8137 0.6785 0.5030 0.2087 3.5338 1.6172 2.2144 25.5722 22.1149 11.4580 7.2329 24.7611 4.9044 32.5190 20.1405 3.4135 4.6381 125.8214 5.1042 37.0822 7.4472 79.2173 13.4907 0.0998 9.0515 7.0959 26.8176 8.6970 25.0610 71.2013 0.1435 0.7847 3.2443 6.4723 33.9990 22.2736 237.4808 0.5301 16.4899 23.6538 41.4328 23.7819 6.0262 58.6839 10.3240 10.9866 30.6471 18.6065 10.2606 91.3474 12.6842 30.0774 45.6779 44.2483 4.9441 8.9391 14.2726 24.2705 6.8465 17.1217 19.4577 24.0310 147.7903 8.3745 153.9927 45.6870 210.7109 34.7938 13.7699 21.9953 27.3809 1.4388 10.9542 14.2573 41.9537 2.3940 5.6698 14.8882 42.4188 30.1188 2.7080 3.7152 21.3734
temp: 298.150 k
press: 1.00000 atm
elementType: 17 8 8 7 6 6 6 6 6 6 6 6 6 6 6 6 6 1 1 1 1 1 1 1 1 1 1 1 1 1 1 1 1
symmnumber: 1
zpe: 692440.3 jmol-1
zpe.correction: 0.263737 hartree
zpe.thermalcorrener: 0.281089 hartree
zpe.thermalcorrenthalpy: 0.282033 hartree
zpe.thermalcorrgfe: 0.214606 hartree
zpe.sumelectzpe: -1168.945397 hartree
zpe.sumelectthermal: -1168.928045 hartree
zpe.sumelectthermalent: -1168.927101 hartree
zpe.sumelectthermalfe: -1168.994528 hartree
dipole: -0.2762 -1.8425 2.0971
dipole: 2.8051
quadrupole: -109.9195 -109.3400 -102.8559
quadrupole: 5.7875 2.1572 -2.1590
quadrupole: -2.5477 -1.9682 4.5159 5.7875 2.1572 -2.1590
hfenergy: -1169.2091339 hartree
pointgroup: C01 [X(C13H16Cl1N1O2)]
dipole: 0.1088195 -0.7042232 -0.8427312 debye
polarizability: 157.115741|-9.9103762|173.7441157|24.4357519|6.7020936|150.4778858 unknown
InChI: InChI=1S/C13H16ClNO2/c1-11(14)10-15(9-5-8-13(16)17)12-6-3-2-4-7-12/h2-4,6-7,16H,1,5,8-10H2
charge 0 multiplicity 1
33 atoms
Cl -2.612856 -2.738616 1.027455
O  4.660929 -1.198416 -1.23866
O  4.67702 0.118644 0.673534
N  -0.423157 -0.530749 0.195576
C  0.417278 -0.948718 1.339103
C  1.896906 -0.497888 1.244572
C  -0.813125 -1.551059 -0.784366
C  -0.923264 0.788535 0.106386
C  2.602059 -1.063105 -0.001138
C  -1.74249 1.20281 -0.989641
C  -0.617528 1.764584 1.105522
C  -2.231797 -2.096814 -0.655359
C  4.051315 -0.632163 -0.105373
C  -2.218738 2.526485 -1.07952
C  -1.106736 3.082345 1.004941
C  -1.908818 3.483547 -0.087393
C  -3.169473 -2.186936 -1.620697
H  -0.023451 -0.576095 2.283708
H  0.372537 -2.05094 1.403904
H  2.4257 -0.830764 2.158409
H  1.965509 0.604104 1.228662
H  -0.700325 -1.170911 -1.819908
H  -0.112532 -2.400466 -0.683613
H  2.08372 -0.733281 -0.922433
H  2.578987 -2.171137 -0.015602
H  -2.031451 0.493654 -1.768732
H  0.001943 1.503978 1.967578
H  -2.845999 2.806705 -1.934034
H  -0.852238 3.8024 1.791461
H  -2.283732 4.509371 -0.160964
H  -4.150628 -2.636145 -1.449125
H  -2.956068 -1.798573 -2.623545
H  5.608302 -0.894986 -1.285309
