program: Gaussian 09
title: 000294819
version: EM64L-G09RevD.01
frameworkgroup: C1[X(C12H23NO3)]
method: RPBEPBE
basis: SDD
operation: Freq
keyword: #p
keyword: freq=noraman
keyword: PBEPBE/SDD
title: #p freq=noraman PBEPBE/SDD
converged: YES YES NO NO
title: Mulliken charges:
elementType: O O O N C C C C C C C C C C C C H H H H H H H H H H H H H H H H H H H H H H H
charge: -0.259226 -0.285955 -0.228971 -0.195517 0.294440 -0.443071 0.222216 -0.371957 -0.240817 -0.714804 -0.703107 -0.731432 -0.715241 0.198380 -0.260031 -0.665577 0.204812 0.242307 0.202442 0.222753 0.201356 0.209178 0.214200 0.216267 0.243412 0.209126 0.223563 0.216335 0.241012 0.216700 0.213598 0.238017 0.222453 0.216340 0.220375 0.234114 0.217404 0.251544 0.223363
chargesum: 0.00000
title: Mulliken charges with hydrogens summed into heavy atoms:
elementType: O O O N C C C C C C C C C C C C
charge: -0.259226 -0.285955 -0.228971 -0.195517 0.294440 0.004049 0.222216 0.053238 0.169718 -0.040925 -0.054083 -0.060123 -0.038432 0.198380 0.194457 0.026733
polarizability: 1.65075112e+02 -1.22025052e+00 1.43278101e+02 4.11623880e+00 -4.36357686e+00 1.26035497e+02
1716.lowfreq: -11.5650 -0.0010 -0.0008 -0.0007 3.3144 5.9672 17.8021 30.8566 42.7839
frequency: 16.5740 29.9248 41.9206 54.7907 69.8006 81.8120 118.2194 167.4614 174.6747 195.5501 205.1611 215.5554 222.4661 227.5916 232.9595 252.0317 259.0078 296.7517 316.8061 333.5745 337.7538 376.4869 381.0441 411.3656 448.3362 450.9215 486.5401 580.0178 610.6103 659.7806 699.9523 736.8630 741.9390 801.7908 818.3868 832.8682 866.0662 880.6206 899.2061 912.5581 934.7442 944.3576 959.1683 971.1578 998.5349 1010.4523 1017.2583 1017.8341 1065.6843 1068.5040 1087.2656 1098.3522 1138.5202 1153.0856 1155.8108 1171.2494 1187.0228 1194.7566 1200.8654 1233.1876 1238.5016 1267.2207 1278.6487 1312.9437 1323.2502 1352.5896 1354.5431 1365.0444 1368.2502 1376.2440 1390.2514 1393.2993 1396.6006 1452.9652 1455.0857 1457.9942 1461.8749 1462.5913 1463.0725 1468.0899 1472.8007 1480.0781 1480.9445 1484.1083 1484.2870 1489.3103 1506.6720 1624.1528 2876.3338 2913.8195 2968.8081 2976.8499 2977.3255 2981.3697 2983.5463 2992.1147 2992.5644 3028.1162 3065.8757 3067.6908 3073.8449 3082.7982 3083.9142 3086.2771 3087.6598 3088.6627 3091.8319 3093.8959 3094.6251 3103.6913 3117.5340
redmass: 3.4801 3.4106 2.8738 3.3787 3.0947 3.5105 3.2632 2.2566 2.8597 1.8019 1.4009 1.8243 1.2625 1.9252 1.7909 1.1379 1.2237 2.3669 2.4118 2.5748 2.6962 2.9229 2.1399 3.0675 2.5813 2.5916 3.2768 3.9418 4.1959 4.4989 5.7167 3.0217 5.1267 1.9279 1.9253 2.6921 2.5381 4.3086 1.8936 1.6563 1.5347 1.4573 1.7699 2.0109 1.8527 2.1809 2.0961 1.6651 2.1118 1.9286 3.0174 2.3260 1.4209 1.6634 1.5178 2.1407 2.7590 2.5993 3.1500 2.2204 2.7212 2.8153 1.1181 1.3239 1.3700 1.2792 1.2450 1.2637 1.2181 1.2200 1.2317 1.2115 1.2189 1.0713 1.0961 1.0572 1.0720 1.0489 1.0523 1.0519 1.0622 1.0548 1.0589 1.0511 1.0621 1.0540 1.0894 9.5715 1.0709 1.0625 1.0672 1.0438 1.0885 1.0377 1.0342 1.0361 1.0373 1.0592 1.0903 1.0975 1.0984 1.1004 1.1000 1.0977 1.0987 1.0995 1.1031 1.0992 1.1000 1.0999 1.1058
irintensity: 2.0235 0.6562 1.4620 1.9255 0.2161 0.4959 2.6051 3.2817 6.2336 1.8361 2.3639 0.4775 0.2905 0.2543 2.2491 0.3923 0.3955 1.2355 7.9408 1.4389 6.8730 2.5673 3.8840 3.6820 0.5558 2.3015 6.4498 2.8131 3.2523 4.9827 7.5801 7.0894 5.7131 12.3185 5.4939 6.5906 14.9287 27.7945 16.0695 11.1096 3.8642 2.2028 6.6382 11.2772 4.8547 8.3324 31.8235 33.8888 66.6769 66.5646 255.2647 32.8992 6.3822 22.0177 4.3743 19.5731 34.4517 30.2413 73.1237 14.8675 36.7329 19.0273 3.7881 17.7972 4.2062 1.0161 4.7461 7.1505 5.8024 36.4593 25.7627 7.4967 40.3748 0.6403 13.0882 2.2400 9.4321 3.5580 11.5746 2.3662 2.3074 33.6797 12.5329 9.1200 24.4163 14.3108 2.4292 169.2885 57.0754 105.8684 53.2148 6.7352 91.1718 13.8987 35.7994 24.9795 21.2833 33.8406 8.3675 3.1164 67.0514 10.7458 20.0064 36.5386 29.9569 14.5624 2.6794 30.5407 46.9007 27.9023 31.2049
temp: 298.150 k
press: 1.00000 atm
elementType: 8 8 8 7 6 6 6 6 6 6 6 6 6 6 6 6 1 1 1 1 1 1 1 1 1 1 1 1 1 1 1 1 1 1 1 1 1 1 1
symmnumber: 1
zpe: 882509.8 jmol-1
zpe.correction: 0.336130 hartree
zpe.thermalcorrener: 0.355364 hartree
zpe.thermalcorrenthalpy: 0.356308 hartree
zpe.thermalcorrgfe: 0.287515 hartree
zpe.sumelectzpe: -750.168034 hartree
zpe.sumelectthermal: -750.148800 hartree
zpe.sumelectthermalent: -750.147856 hartree
zpe.sumelectthermalfe: -750.216650 hartree
dipole: -0.4826 -2.8477 1.4548
dipole: 3.2340
quadrupole: -102.2823 -97.9363 -100.2633
quadrupole: 4.7115 3.9125 2.0627
quadrupole: -2.1217 2.2243 -0.1026 4.7115 3.9125 2.0627
hfenergy: -750.5041646 hartree
pointgroup: C01 [X(C12H23N1O3)]
dipole: -0.1190736 0.6778755 -1.0701213 debye
polarizability: 165.3300769|-1.5345328|135.0678059|-3.014322|-9.6054583|133.9908275 unknown
InChI: InChI=1S/C12H23NO3/c1-6-16-10(14)11(2,3)7-13-9-15-8-12(13,4)5/h6-9H2,1-5H3
charge 0 multiplicity 1
39 atoms
O  3.527971 0.036606 1.623161
O  -2.50051 0.487372 -0.745582
O  -3.261936 -0.735392 1.082817
N  1.513166 -0.17648 0.391775
C  2.49002 0.61663 -0.447196
C  0.096229 0.210096 0.365659
C  -0.902774 -1.006399 0.307294
C  3.813575 0.1112 0.17619
C  2.128339 -0.403472 1.727664
C  2.361916 2.154556 -0.246446
C  2.368927 0.242321 -1.936694
C  -0.749032 -1.934623 1.533158
C  -0.671217 -1.809042 -1.003733
C  -2.333317 -0.437156 0.295855
C  -3.854492 1.108646 -0.878273
C  -3.985326 2.33219 0.033143
H  -0.172064 0.836788 1.25113
H  -0.092484 0.820959 -0.53331
H  4.076448 -0.89076 -0.221833
H  4.657999 0.807186 0.050693
H  1.648462 0.198798 2.532084
H  2.101321 -1.475109 2.010211
H  3.085127 2.690173 -0.889189
H  1.351902 2.514067 -0.514183
H  2.564264 2.427464 0.804881
H  3.160316 0.737666 -2.529547
H  2.453355 -0.850279 -2.069021
H  1.394019 0.562494 -2.348099
H  -1.563003 -2.678401 1.560761
H  0.213581 -2.470109 1.476535
H  -0.790441 -1.367809 2.481168
H  0.385841 -2.126321 -1.032911
H  -0.8822 -1.190491 -1.893154
H  -1.315369 -2.706412 -1.037932
H  -3.912369 1.378005 -1.945246
H  -4.614668 0.345774 -0.634347
H  -4.959242 2.826292 -0.142013
H  -3.936752 2.03531 1.094074
H  -3.185881 3.065265 -0.172448
