program: Gaussian 09
title: 000294810
version: EM64L-G09RevD.01
frameworkgroup: C1[X(C10H11Cl2NO2)]
method: RPBEPBE
basis: SDD
operation: Freq
keyword: #p
keyword: freq=noraman
keyword: PBEPBE/SDD
title: #p freq=noraman PBEPBE/SDD
converged: YES YES NO NO
title: Mulliken charges:
elementType: Cl Cl O O N C C C C C C C C C C H H H H H H H H H H H
charge: -0.027568 -0.023794 -0.408079 -0.241540 -0.433705 -0.070578 -0.483632 -0.733655 0.523441 -0.447150 -0.393715 0.182624 -0.020490 -0.192390 -0.131967 0.253703 0.248535 0.274083 0.294922 0.206997 0.241014 0.240325 0.249689 0.260072 0.253997 0.378863
chargesum: 0.00000
title: Mulliken charges with hydrogens summed into heavy atoms:
elementType: Cl Cl O O N C C C C C C C C C C
charge: -0.027568 -0.023794 -0.029216 -0.241540 -0.138783 0.183125 0.038985 -0.045319 0.523441 -0.197462 -0.133643 0.182624 -0.020490 0.061607 -0.131967
polarizability: 2.21965431e+02 -6.28482375e+00 1.36891190e+02 6.84310728e+00 9.95718562e+00 8.23558789e+01
1716.lowfreq: -7.9295 -4.9614 -3.8556 -0.0005 0.0013 0.0017 21.1371 27.6244 33.5248
frequency: 21.0917 27.5580 33.4906 60.5925 117.6305 124.1484 157.8393 172.1489 182.5997 216.6316 236.0648 285.3680 302.3743 352.1546 374.4365 391.0854 407.2897 431.9033 439.4371 459.1563 528.7729 538.1252 577.8919 612.5125 644.6404 674.3311 679.1594 696.0700 805.6097 839.7634 843.7338 869.2538 886.8927 891.8800 937.0395 973.7212 986.9447 1038.3330 1103.1621 1111.9920 1120.2176 1155.3222 1171.7140 1204.6363 1244.6146 1258.6356 1301.1739 1313.6246 1341.4863 1355.3554 1361.3084 1393.0107 1406.8336 1443.4849 1464.3759 1473.9485 1477.5259 1494.5049 1569.3298 1615.1043 1652.3814 2980.5908 3000.4464 3003.6805 3076.6635 3087.4200 3098.9609 3147.0679 3153.7516 3173.6465 3500.7369 3556.9359
redmass: 9.7316 7.7882 9.0380 3.7931 5.1935 4.3461 4.7535 8.6821 11.2203 1.6399 2.1316 4.2328 5.3151 3.7081 2.3553 1.6355 4.0297 3.3129 3.4442 4.1361 4.8851 2.4394 4.9449 2.8270 5.9102 1.6507 2.9526 6.7827 1.3578 1.6695 3.3142 3.4853 2.8665 1.7082 1.3228 2.0760 4.5686 1.9170 2.8487 2.0430 2.2510 1.5188 2.1828 1.3135 1.3991 1.3865 1.9636 1.6323 1.6775 2.0069 1.7148 1.2394 4.1684 1.1067 1.7839 1.2095 1.0667 2.3715 4.7555 6.8539 8.3309 1.0394 1.0666 1.0799 1.0977 1.0979 1.1000 1.0919 1.0878 1.0968 1.0638 1.0769
irintensity: 1.3553 0.2484 0.4138 0.6485 1.2877 0.1766 1.7323 0.2802 0.1898 0.2058 1.2213 1.1859 0.5989 9.0219 0.9533 85.9675 15.1607 28.3365 6.3785 29.4707 17.7606 35.4303 2.3906 21.3028 34.1963 107.2100 2.0949 11.7586 31.7357 46.2819 14.6788 12.1463 7.6289 7.8784 0.1220 19.1753 15.6803 280.3809 7.8327 122.2621 83.6831 4.7634 53.1546 3.0329 11.8424 30.2132 13.7989 61.2734 50.5130 26.2159 105.0994 42.1343 1.2913 14.2397 38.2559 41.4504 28.1711 211.0376 42.9404 222.7094 199.0055 21.8641 4.3331 8.5839 21.9621 14.9872 24.5355 3.7524 6.6315 4.4497 26.0287 31.8849
temp: 298.150 k
press: 1.00000 atm
elementType: 17 17 8 8 7 6 6 6 6 6 6 6 6 6 6 1 1 1 1 1 1 1 1 1 1 1
symmnumber: 1
zpe: 506207.7 jmol-1
zpe.correction: 0.192804 hartree
zpe.thermalcorrener: 0.208355 hartree
zpe.thermalcorrenthalpy: 0.209299 hartree
zpe.thermalcorrgfe: 0.147092 hartree
zpe.sumelectzpe: -1511.875907 hartree
zpe.sumelectthermal: -1511.860356 hartree
zpe.sumelectthermalent: -1511.859412 hartree
zpe.sumelectthermalfe: -1511.921619 hartree
dipole: -5.1397 2.1951 0.5901
dipole: 5.6199
quadrupole: -105.8679 -95.5655 -106.3168
quadrupole: -2.7078 -3.6615 -2.2278
quadrupole: -3.2845 7.0179 -3.7334 -2.7078 -3.6615 -2.2278
hfenergy: -1512.0687109 hartree
pointgroup: C01 [X(C10H11Cl2N1O2)]
dipole: -2.0064281 -0.9118997 -0.1772717 debye
dipolederiv: -0.5886865 0.2381641 0.1383112 0.3226584 -0.2400238 -0.0930662 0.1705675 -0.0840771 -0.0933329 -0.5934116 -0.3131595 0.0289763 -0.3714828 -0.2926224 0.0094186 0.0380619 0.0114461 -0.0380926 -1.1042155 -0.0666355 -0.5290254 -0.0471557 -0.3115989 0.0716658 -0.5261085 0.0547429 -0.7058478 -0.6692603 0.173609 0.0106891 0.1147673 -0.5879408 -0.3019694 -0.0746413 -0.2262061 -0.7284935 -1.7034181 -0.3510713 0.0213988 -0.6869481 -0.5118079 0.1987302 0.2079786 0.238243 -0.4650484 1.1405031 -0.0652393 0.033952 -0.4380053 0.2198503 -0.0934121 0.0805802 -0.2342726 0.3518492 -0.5741843 0.1802862 0.0161295 0.3892254 -0.0634145 0.0463526 -0.0404349 0.1045897 -0.1006505 -0.1160098 -0.0405325 0.0262608 -0.0022327 0.0312582 0.0659603 -0.0074175 0.0916387 0.056036 1.4035146 0.570135 -0.0677071 1.0021811 0.4142026 -0.0819094 -0.0867194 -0.0695788 0.1312089 -0.6936256 -0.2041103 0.029411 0.1291872 -0.0918177 -0.0049099 0.1024226 0.0516745 -0.1925356 -0.2668215 0.0303587 0.0061506 -0.5331811 -0.1856457 0.0794494 -0.145737 0.0236164 -0.2206636 1.5954451 -0.3574241 0.4559869 -0.3182676 0.6350641 0.3745774 0.3395918 0.3652011 1.0224683 0.8207821 -0.3593097 -0.2161378 -0.4285854 0.5185219 0.1739914 -0.2431634 0.1722016 0.071181 0.2113205 -0.1957619 -0.0846692 0.0548946 -0.0032791 0.0146504 -0.0474442 0.0505967 -0.0458757 0.396528 0.6606448 0.0319351 0.5823771 0.0965039 -0.0590739 0.0151 -0.0902728 -0.1337539 0.016583 -0.0435698 -0.0250168 0.0431035 -0.0201197 -0.0876589 -0.0367842 -0.0345382 -0.026743 0.0577044 0.0005262 -0.0504317 -0.0184987 -0.0106421 -0.0931105 -0.0470644 -0.0600654 0.0189355 0.1257863 -0.0573187 0.0694502 -0.0489984 -0.0175997 0.0526362 0.1300819 0.0202565 0.0810089 0.0983041 -0.000967 0.0178213 0.0686732 0.1512347 -0.0562233 0.0205504 -0.0906031 0.2813868 0.0957446 0.014491 0.019652 -0.0462008 -0.0375544 -0.0749868 -0.0110983 -0.1483856 -0.0525128 -0.1361152 0.0333371 0.0390253 0.0815661 0.0548411 -0.0268292 0.0225671 -0.0135196 0.1017005 0.0969464 0.0468324 -0.0870688 0.0215275 0.0230736 0.0890049 -0.0680126 0.0978629 -0.0634748 0.0726377 -0.043183 0.0115819 -0.0279853 -0.049859 -0.0381617 0.0158816 -0.0368478 0.1610778 -0.0424161 0.0496624 0.053303 0.0666278 0.0708202 -0.0227838 0.0756061 -0.0295414 0.1487941 0.086741 0.0036791 0.0139623 -0.0081248 -0.0335865 -0.0395571 0.0103567 -0.0386224 0.1470873 0.2696236 0.0965564 0.0360592 0.0988776 0.2421413 -0.1027849 0.1052792 -0.1255392 0.2942911 unknown
polarizability: 221.1347504|8.5592895|137.2602248|-10.8245265|9.5061372|82.817524 unknown
InChI: InChI=1S/C10H11Cl2NO2/c1-6(4-10(14)15)13-7-2-3-8(11)9(12)5-7/h2-3,5-6,13-14H,4H2,1H3
charge 0 multiplicity 1
26 atoms
Cl 4.536862 -1.342624 -0.724745
Cl 4.542466 1.899221 -0.080406
O  -4.69487 0.692508 -1.271406
O  -3.694063 1.574237 0.629735
N  -0.560446 -1.357761 0.284021
C  -1.898492 -0.817682 0.547098
C  -2.475054 -0.092176 -0.715768
C  -2.828761 -1.952025 1.01676
C  0.600901 -0.588516 0.191188
C  1.828039 -1.217709 -0.174427
C  0.613778 0.8131 0.465982
C  -3.638245 0.805347 -0.358242
C  3.014618 -0.471935 -0.255431
C  1.816027 1.542024 0.381095
C  3.024164 0.912636 0.019859
H  -1.829039 -0.065912 1.356932
H  -2.77754 -0.818555 -1.48783
H  -1.680791 0.547391 -1.147707
H  -0.499293 -2.34461 0.032188
H  -2.927685 -2.734944 0.239862
H  -3.838234 -1.562127 1.231892
H  -2.438183 -2.417993 1.938079
H  1.857012 -2.290672 -0.391683
H  -0.298942 1.338852 0.759594
H  1.819204 2.614402 0.597987
H  -5.425634 1.316923 -1.007626
