program: Gaussian 09
title: 000294789
version: EM64L-G09RevD.01
frameworkgroup: C1[X(C16H15NO)]
method: RPBEPBE
basis: SDD
operation: Freq
keyword: #p
keyword: freq=noraman
keyword: PBEPBE/SDD
title: #p freq=noraman PBEPBE/SDD
converged: YES YES NO NO
title: Mulliken charges:
elementType: O N C C C C C C C C C C C C C C C C H H H H H H H H H H H H H H H
charge: -0.224268 -0.268731 -0.467019 -0.379017 -0.518280 0.266683 0.142923 0.082090 0.426301 -0.357269 -0.359197 -0.376605 -0.390813 -0.225942 -0.254723 -0.220164 -0.220831 -0.263649 0.217952 0.262257 0.230575 0.224952 0.246289 0.242020 0.271474 0.280083 0.264527 0.220775 0.231166 0.235081 0.226459 0.224290 0.230611
chargesum: 0.00000
title: Mulliken charges with hydrogens summed into heavy atoms:
elementType: O N C C C C C C C C C C C C C C C C
charge: -0.224268 -0.268731 0.013190 0.076510 -0.029971 0.266683 0.142923 0.082090 0.426301 -0.085795 -0.079114 -0.112078 -0.170038 0.005224 -0.019642 0.006295 0.003459 -0.033038
polarizability: 2.70125384e+02 -6.82797296e+00 1.82943142e+02 -3.90979873e+00 8.46541926e+00 1.15291978e+02
1716.lowfreq: -8.5866 -6.3569 -3.0347 -0.0006 -0.0006 0.0006 21.0628 52.3151 74.0370
frequency: 20.7914 52.3134 74.0326 88.5251 140.8894 160.3307 198.8907 232.2824 254.0305 305.1677 347.9105 367.7852 384.9472 406.2667 423.4311 431.6627 494.3250 511.2614 544.0138 562.4746 592.5566 602.4673 614.5293 656.9233 691.1634 720.0598 737.1656 758.2868 760.3811 774.5749 784.8273 827.8107 863.6304 879.6850 888.2843 896.6916 951.2912 966.1455 975.1711 981.1418 985.5185 995.1797 999.4536 1028.6767 1031.0371 1063.5569 1072.0947 1080.3535 1103.1511 1110.7377 1160.7224 1171.3956 1173.0586 1189.5753 1195.3375 1229.4853 1232.4566 1267.7518 1289.9774 1295.4709 1323.6163 1341.1293 1342.9163 1360.1970 1379.8885 1387.5013 1431.8931 1449.6398 1453.3274 1464.3321 1467.6454 1485.1607 1490.1587 1561.0983 1571.1366 1583.8507 1605.9505 1614.8466 2994.9692 2999.7446 3018.6349 3054.8635 3080.3363 3085.0565 3126.6798 3130.7985 3133.2516 3145.5584 3152.0444 3156.5575 3157.8404 3168.9900 3170.3055
redmass: 4.1275 5.0075 4.4605 4.5522 4.5517 3.9910 2.4550 4.3947 4.8665 4.9397 3.5482 5.2029 3.1890 2.9451 3.4798 4.7364 2.9502 3.0343 3.6966 4.5175 4.1693 3.8406 6.3530 5.3114 1.9675 3.3427 3.3551 1.8734 2.5351 1.7136 1.7084 1.2723 3.0306 1.8500 2.1064 1.4553 2.3441 1.3736 1.3610 5.6633 1.3041 1.4420 2.4042 2.1762 2.6858 2.2009 2.0175 2.1627 1.8998 2.3157 1.3699 1.0727 1.0550 1.3083 1.1744 2.1998 1.7308 1.6102 1.6451 1.6389 1.5429 1.7762 1.5632 1.4157 5.0016 6.4192 2.4257 2.3056 1.1613 1.4469 1.5679 2.2786 1.1410 7.3282 7.4730 6.2814 6.3327 6.3987 1.0586 1.0633 1.0639 1.0995 1.1026 1.1017 1.0846 1.0859 1.0882 1.0891 1.0918 1.0948 1.0945 1.1005 1.1009
irintensity: 3.6713 0.8549 3.5056 2.2420 2.6772 2.8272 0.4626 0.8934 3.7147 3.0494 2.2146 1.4147 1.8457 2.1960 5.0025 2.5225 14.9020 2.8132 5.7418 7.5120 2.1884 6.0390 0.2082 6.5165 33.5475 4.5652 25.0682 67.9120 32.5838 34.4943 15.1558 0.7647 18.2014 1.5940 8.0397 1.1352 11.5037 0.5026 1.8048 1.6450 0.2315 2.0920 13.8784 8.2117 21.4925 5.9583 6.6950 0.8394 9.4070 33.5808 34.4943 7.5420 0.2047 37.6443 28.3197 9.1072 95.9255 12.4920 47.7481 49.7557 13.0032 53.8573 36.8952 30.2579 10.2311 1.5389 41.3917 6.0820 15.6868 105.7923 67.9826 205.9736 26.2152 17.5451 262.1890 10.2678 175.9797 19.9947 34.2831 12.1834 23.3388 28.1143 22.4228 27.4131 8.1426 4.3414 6.8641 7.2762 26.5759 26.5370 9.1680 26.8543 12.1216
temp: 298.150 k
press: 1.00000 atm
elementType: 8 7 6 6 6 6 6 6 6 6 6 6 6 6 6 6 6 6 1 1 1 1 1 1 1 1 1 1 1 1 1 1 1
symmnumber: 1
zpe: 702740.4 jmol-1
zpe.correction: 0.267660 hartree
zpe.thermalcorrener: 0.282060 hartree
zpe.thermalcorrenthalpy: 0.283005 hartree
zpe.thermalcorrgfe: 0.225407 hartree
zpe.sumelectzpe: -747.408731 hartree
zpe.sumelectthermal: -747.394330 hartree
zpe.sumelectthermalent: -747.393386 hartree
zpe.sumelectthermalfe: -747.450984 hartree
dipole: 3.2037 0.8957 -0.9337
dipole: 3.4551
quadrupole: -112.8173 -98.4660 -104.0025
quadrupole: -10.1188 1.5022 5.1529
quadrupole: -7.7220 6.6293 1.0928 -10.1188 1.5022 5.1529
hfenergy: -747.6763908 hartree
pointgroup: C01 [X(C16H15N1O1)]
dipole: -1.2451385 -0.3991266 -0.3716092 debye
polarizability: 270.2616731|-4.1824114|181.9298381|6.6257623|-10.8958487|116.168992 unknown
InChI: InChI=1S/C16H15NO/c18-16-11-6-12-17(13-7-2-1-3-8-13)15-10-5-4-9-14(15)16/h1-5,7-10H,6,11-12H2
charge 0 multiplicity 1
33 atoms
O  3.442095 1.875351 0.629518
N  -0.321338 0.305933 -0.599737
C  0.012763 1.576799 -1.293026
C  0.238771 2.748009 -0.311151
C  1.059341 2.264082 0.916799
C  0.769809 -0.555063 -0.2788
C  2.041172 -0.024042 0.123477
C  2.266448 1.40656 0.531612
C  -1.664874 0.009867 -0.218322
C  0.640462 -1.960374 -0.476039
C  3.154336 -0.906699 0.236636
C  -1.925384 -0.811265 0.919141
C  -2.777917 0.546042 -0.927131
C  1.743898 -2.814819 -0.311869
C  3.017817 -2.288171 0.030608
C  -3.246837 -1.100138 1.312198
C  -4.097534 0.257487 -0.518499
C  -4.347961 -0.570166 0.599045
H  -0.774805 1.825767 -2.023129
H  0.935578 1.39585 -1.872476
H  -0.726617 3.155871 0.041912
H  0.773053 3.562071 -0.837166
H  1.43211 3.128165 1.492491
H  0.389314 1.668501 1.566189
H  -0.32466 -2.364715 -0.796507
H  4.114939 -0.464334 0.520952
H  -1.088771 -1.211356 1.500356
H  -2.627525 1.176888 -1.808174
H  1.621431 -3.890612 -0.481593
H  3.880563 -2.953472 0.138237
H  -3.415402 -1.731395 2.192174
H  -4.934672 0.679967 -1.085947
H  -5.373805 -0.791485 0.910822
