program: Gaussian 09
title: 000294848
version: EM64L-G09RevD.01
frameworkgroup: C1[X(C18H11N5O9)]
method: RPBEPBE
basis: SDD
operation: Freq
keyword: #p
keyword: freq=noraman
keyword: PBEPBE/SDD
title: #p freq=noraman PBEPBE/SDD
converged: YES YES NO NO
title: Mulliken charges:
elementType: O O O O O O O O O N N N N N C C C C C C C C C C C C C C C C C C H H H H H H H H H H H
charge: -0.244804 -0.176340 -0.255039 -0.185518 -0.161770 -0.206168 -0.198551 -0.198658 -0.190795 -0.475357 0.026336 0.017833 0.010451 0.021685 0.339772 0.442263 0.226530 0.336502 -0.358409 -0.396483 -0.308119 0.225205 -0.355503 -0.351002 -0.498920 0.447595 0.284774 -0.403775 -0.274392 -0.475181 0.430858 -0.379924 0.357949 0.281490 0.261821 0.281723 0.275444 0.277485 0.338728 0.295548 0.283184 0.334659 0.296872
chargesum: 0.00000
title: Mulliken charges with hydrogens summed into heavy atoms:
elementType: O O O O O O O O O N N N N N C C C C C C C C C C C C C C C C C C
charge: -0.244804 -0.176340 -0.255039 -0.185518 -0.161770 -0.206168 -0.198551 -0.198658 -0.190795 -0.117408 0.026336 0.017833 0.010451 0.021685 0.339772 0.442263 0.226530 0.336502 -0.076919 -0.134662 -0.026395 0.225205 -0.080058 -0.073517 -0.160192 0.447595 0.284774 -0.108228 0.008792 -0.140522 0.430858 -0.083052
polarizability: 5.65904389e+02 2.93830349e+00 3.43258368e+02 -7.64911610e+00 1.08973087e+01 1.38360733e+02
1716.lowfreq: -1.6393 -0.0010 -0.0006 0.0004 0.5527 4.4093 11.2241 16.2495 17.3400
frequency: 11.1582 16.2280 17.3223 37.3048 42.7145 50.9773 54.2715 57.7877 61.6390 78.5885 101.3334 116.8160 129.4859 145.2196 154.1498 158.7447 167.3256 188.2686 232.5015 257.7690 288.5001 298.2785 306.1996 319.2961 325.4790 348.0414 372.9765 392.1583 402.5091 413.7956 423.7391 438.3827 447.8162 488.5157 496.7945 503.7311 514.8058 515.7824 539.3134 586.6140 612.1871 617.8201 636.7174 645.3976 650.7044 657.0559 668.0172 678.9778 703.2808 706.2216 710.8112 722.1643 736.4680 749.9742 753.7449 758.4576 795.5691 817.6407 823.3944 830.1710 843.0187 845.4212 849.6472 868.0806 888.0430 898.7517 953.8111 955.8055 966.5254 968.3369 991.3373 1000.7530 1002.7580 1050.3284 1054.2519 1104.5672 1112.4069 1116.9191 1144.1854 1144.8878 1153.4388 1162.0975 1189.0318 1202.0170 1204.6771 1215.5128 1231.5191 1238.8876 1248.5539 1254.9168 1298.3852 1311.8597 1346.4458 1360.5196 1362.6733 1368.7084 1376.1390 1387.8185 1401.7928 1422.4130 1427.5106 1446.5610 1463.9603 1488.5322 1493.7279 1530.6676 1582.0004 1589.1245 1597.7478 1604.1182 1613.7416 1626.9451 3150.6929 3151.5914 3168.7578 3169.8749 3174.4807 3182.0183 3187.0574 3187.4313 3189.2381 3190.8806 3200.6475
redmass: 12.0178 9.0259 10.1188 9.3860 11.0859 5.7691 10.6757 12.4638 9.7245 10.0482 7.6449 12.9524 8.0174 7.7963 6.3234 11.8265 5.9869 8.1099 8.4935 8.4229 7.5537 9.0064 8.5420 9.1758 8.5953 9.5622 11.8245 7.0571 5.8473 3.1624 4.5345 4.7093 4.9749 5.7389 6.5237 4.5175 4.7025 4.1367 5.2950 5.9734 6.7397 7.1972 6.8428 7.1278 7.8218 7.5976 9.1582 7.2400 5.2449 6.6884 6.4422 4.9158 5.7790 6.1859 12.0832 8.7024 4.3393 1.4029 1.6871 2.5213 1.5020 3.1153 1.5106 1.9578 7.5876 5.4037 1.4721 1.3276 1.4109 1.3574 1.3384 1.4384 2.3858 2.2152 2.2486 3.6970 4.0077 1.3861 1.3973 1.4493 2.2097 6.5019 1.4058 8.1049 4.5106 7.1341 3.8523 2.4555 1.8561 1.9422 1.4501 2.0310 5.6603 5.6408 4.0773 7.9800 11.8144 7.2785 9.6270 3.8854 6.1364 5.4358 2.8293 3.1982 2.8478 3.2132 7.6800 7.4399 3.4782 6.5975 6.2907 6.7292 1.0906 1.0888 1.0903 1.0930 1.0908 1.0965 1.0919 1.0931 1.0961 1.0970 1.0788
irintensity: 0.0882 3.0223 2.0086 1.7459 0.1578 0.1972 0.3820 0.2398 0.4454 0.8984 3.9136 0.5620 1.9267 1.9649 0.4417 8.5065 1.5980 1.1476 1.7966 4.4703 2.2281 2.7296 1.5688 0.7168 0.4576 0.9892 0.1438 1.6762 0.4515 0.6074 1.7875 0.2039 5.2529 4.3408 25.6447 10.9529 12.3540 10.0687 1.8458 4.1021 3.0713 9.6492 7.9646 7.1089 17.0353 13.6656 15.3310 23.4904 7.0858 5.4887 11.1467 8.8445 7.5252 10.7996 6.8202 27.6395 25.0388 14.2839 54.1514 0.1034 4.1650 28.1051 75.2910 58.3536 49.2887 13.7408 25.4816 2.4082 26.1984 1.8800 1.3589 9.0187 25.4526 16.8669 51.9483 42.4763 6.1556 29.8837 16.8319 7.5258 290.3902 325.7284 160.0000 553.2282 447.7547 365.7798 109.5696 336.8593 102.4828 51.4912 16.9656 66.8777 223.8601 108.2176 39.8937 18.0812 73.0538 44.6456 39.5776 4.0327 20.3536 1.4906 338.5994 6.6919 445.4633 119.4824 15.8464 86.5606 160.6872 233.8961 149.9615 240.0160 6.1471 13.5590 0.7534 0.4870 2.3138 0.8255 16.2911 15.6520 10.8725 5.2542 170.1218
temp: 298.150 k
press: 1.00000 atm
elementType: 8 8 8 8 8 8 8 8 8 7 7 7 7 7 6 6 6 6 6 6 6 6 6 6 6 6 6 6 6 6 6 6 1 1 1 1 1 1 1 1 1 1 1
symmnumber: 1
zpe: 739840.4 jmol-1
zpe.correction: 0.281790 hartree
zpe.thermalcorrener: 0.308643 hartree
zpe.thermalcorrenthalpy: 0.309588 hartree
zpe.thermalcorrgfe: 0.219336 hartree
zpe.sumelectzpe: -1640.702902 hartree
zpe.sumelectthermal: -1640.676049 hartree
zpe.sumelectthermalent: -1640.675105 hartree
zpe.sumelectthermalfe: -1640.765357 hartree
dipole: -0.1328 -0.4578 -2.3985
dipole: 2.4454
quadrupole: -296.8517 -221.6107 -178.5513
quadrupole: -4.5972 3.8479 6.3354
quadrupole: -64.5138 10.7272 53.7866 -4.5972 3.8479 6.3354
hfenergy: -1640.9846926 hartree
pointgroup: C01 [X(C18H11N5O9)]
dipole: 0.0600772 0.2543497 -0.9259131 debye
polarizability: 565.5880082|4.7449442|343.7792309|12.7290457|5.4486269|138.1562516 unknown
InChI: InChI=1S/C18H11N5O9/c24-20(25)12-3-7-15(16(9-12)22(28)29)19-11-1-5-14(6-2-11)32-18-8-4-13(21(26)27)10-17(18)23(30)31/h1-10,19H
charge 0 multiplicity 1
43 atoms
O  2.894209 1.657611 -0.012647
O  -6.870567 2.213188 0.056348
O  -4.794646 3.032412 -0.386344
O  6.483673 1.865984 1.876657
O  5.091749 3.113578 0.563255
O  -6.115485 -4.006827 0.028836
O  -7.815043 -2.480805 0.134534
O  6.228855 -3.67878 -1.152154
O  7.818036 -2.401396 -0.12116
N  -2.745667 1.425419 -0.373069
N  -5.617225 2.030904 -0.16003
N  -6.566092 -2.793923 0.036971
N  5.578627 1.992709 0.962696
N  6.627432 -2.592313 -0.57855
C  -3.657614 0.396001 -0.271541
C  -1.326339 1.376674 -0.29779
C  -5.078695 0.66701 -0.163742
C  1.483128 1.478995 -0.141915
C  -0.626567 0.504787 0.580591
C  -0.59608 2.321188 -1.069212
C  -3.268682 -0.986229 -0.304106
C  3.771851 0.594407 -0.170505
C  0.778895 0.552712 0.657387
C  0.807984 2.379028 -0.989337
C  -6.023996 -0.375109 -0.056889
C  -5.581423 -1.701727 -0.072342
C  5.107291 0.742902 0.313842
C  -4.202425 -2.015466 -0.212239
C  3.408201 -0.624047 -0.804063
C  6.039042 -0.303527 0.19979
C  5.645817 -1.492476 -0.438085
C  4.339076 -1.661963 -0.949587
H  -3.203153 2.35339 -0.491317
H  -1.173796 -0.167876 1.246845
H  -1.132371 3.006271 -1.734191
H  -2.215191 -1.232578 -0.450024
H  1.31291 -0.095948 1.358894
H  1.381786 3.108894 -1.56651
H  -7.087633 -0.140435 0.034437
H  -3.899699 -3.065004 -0.256954
H  2.393516 -0.741424 -1.193334
H  7.049591 -0.190557 0.601068
H  4.077719 -2.597555 -1.450616
