program: Gaussian 09
title: 000294769
version: EM64L-G09RevD.01
frameworkgroup: C1[X(C14H16O3)]
method: RPBEPBE
basis: SDD
operation: Freq
keyword: #pfreq=noraman
keyword: PBEPBE/SDD
title: #p freq=noraman PBEPBE/SDD
converged: YES YES NO NO
title: Mulliken charges:
elementType: O O O C C C C C C C C C C C C C C H H H H H H H H H H H H H H H H
charge: -0.274747 -0.244141 -0.393742 -0.400233 -0.396637 -0.552938 -0.496722 0.307562 0.059969 -0.394363 0.520634 -0.520137 -0.436536 0.196499 -0.379573 0.154708 -0.538635 0.214562 0.205490 0.215955 0.205595 0.217405 0.211003 0.228382 0.245335 0.197832 0.342279 0.225898 0.219432 0.356062 0.234283 0.230311 0.239205
chargesum: 0.00000
title: Mulliken charges with hydrogens summed into heavy atoms:
elementType: O O O C C C C C C C C C C C C C C
charge: -0.274747 -0.244141 -0.037679 0.019820 0.024913 -0.124530 -0.023004 0.307562 0.059969 -0.196531 0.520634 -0.177858 -0.210638 0.196499 -0.160141 0.154708 0.165164
polarizability: 2.89706103e+02 -1.42007129e+01 1.76978146e+02 6.42923648e+00 -7.22589209e-01 9.00673431e+01
1716.lowfreq: 0.0004 0.0005 0.0008 3.6918 6.7590 10.8595 27.1165 43.3135 77.1352
frequency: 27.1127 43.2864 77.1322 91.3255 110.4421 117.3691 165.0879 199.3000 211.7394 242.8235 252.2700 279.8655 315.9798 326.6305 343.5170 381.4929 397.5445 433.7208 439.7617 467.4534 472.5695 505.6773 538.1311 573.0784 617.5173 633.5154 643.8424 694.2055 733.5670 746.4609 785.5723 787.7829 818.8828 873.7826 880.9045 905.7918 926.8409 932.8084 944.3164 963.0953 976.4002 1005.0121 1073.2445 1084.6728 1091.4326 1109.3338 1111.0136 1128.3411 1145.1498 1155.1287 1169.0847 1182.9259 1223.9183 1242.3185 1248.4139 1262.6640 1280.3561 1309.8193 1313.2058 1324.4935 1338.2184 1348.8229 1386.7077 1421.8018 1433.1595 1439.7998 1449.8061 1463.4454 1465.8233 1467.6719 1469.7638 1476.1365 1501.1579 1519.9196 1588.7632 1603.2989 1607.1944 2947.5515 2959.6354 2971.4677 2979.8556 2981.5266 3027.1421 3037.9837 3047.2827 3048.6639 3061.3181 3062.3045 3109.6824 3129.9433 3138.6238 3145.1586 3566.1689
redmass: 3.4376 5.0091 4.0239 4.3070 3.7328 3.0276 3.0884 3.2524 2.0715 4.5695 3.1502 2.4760 2.2898 3.3854 3.6443 1.1507 3.0917 3.4478 4.2163 3.4327 3.8451 5.3254 3.9543 3.9803 3.5188 3.2662 3.6287 3.6432 5.0800 3.9195 4.2072 1.5991 1.5698 2.6735 1.5250 1.4049 3.3547 2.9315 1.4041 1.4174 3.0215 3.5605 1.8762 1.6899 1.8750 1.8086 1.2650 1.6072 2.3113 1.3747 1.6089 1.5827 2.3106 1.3235 1.8015 1.2753 3.3216 1.3646 1.4642 1.3685 1.4062 1.5636 2.7138 3.9895 1.4050 1.1058 1.5390 1.1164 1.0492 1.0883 1.0848 1.0936 2.9306 8.9126 5.7909 6.5381 6.4976 1.0657 1.0667 1.0322 1.0594 1.0640 1.0945 1.0988 1.0970 1.0909 1.0951 1.1039 1.0875 1.1009 1.0957 1.0930 1.0659
irintensity: 0.4751 2.4198 3.0533 0.8450 6.6827 3.1404 0.6717 2.5593 1.8363 9.5002 2.7239 0.2841 1.9286 5.4640 0.7878 121.6108 13.2266 3.3165 6.1589 0.4002 3.9021 1.3991 23.2418 7.8182 12.3856 1.6070 5.0244 9.1496 10.1088 1.1439 30.1087 37.2175 38.3132 9.5010 1.1740 0.8612 5.6440 19.3498 5.4398 39.2906 5.2212 50.3080 7.5607 179.4329 103.4164 36.4645 0.2357 18.4908 50.4657 12.2566 11.7006 60.2401 134.6966 8.3509 21.9307 28.9584 205.8350 35.7448 1.8485 17.2952 0.5414 2.2205 62.4440 19.1769 34.3847 13.7842 5.5290 25.5706 17.3342 18.5773 60.2242 8.7400 220.9510 251.0297 30.6823 124.2758 53.4850 32.9152 11.1439 38.4405 31.9180 55.6682 27.9465 69.6117 64.0905 22.3873 29.8587 39.8681 19.4815 33.6501 14.4762 59.4708 73.4104
temp: 298.150 k
press: 1.00000 atm
elementType: 8 8 8 6 6 6 6 6 6 6 6 6 6 6 6 6 6 1 1 1 1 1 1 1 1 1 1 1 1 1 1 1 1
symmnumber: 1
zpe: 703015.0 jmol-1
zpe.correction: 0.267764 hartree
zpe.thermalcorrener: 0.283696 hartree
zpe.thermalcorrenthalpy: 0.284640 hartree
zpe.thermalcorrgfe: 0.223922 hartree
zpe.sumelectzpe: -767.469767 hartree
zpe.sumelectthermal: -767.453835 hartree
zpe.sumelectthermalent: -767.452891 hartree
zpe.sumelectthermalfe: -767.513609 hartree
dipole: -2.1435 -2.9392 0.5596
dipole: 3.6806
quadrupole: -88.9355 -89.0154 -102.6515
quadrupole: -8.3612 -0.0101 -0.4497
quadrupole: 4.5987 4.5187 -9.1174 -8.3612 -0.0101 -0.4497
hfenergy: -767.7375312 hartree
pointgroup: C01 [X(C14H16O3)]
dipole: -0.9793481 -0.925538 -0.5302137 debye
polarizability: 284.1022521|-29.658571|147.462275|-5.9450951|44.0969848|125.1870649 unknown
InChI: InChI=1S/C14H16O3/c1-17-14-9-10(6-7-13(14)16)8-11-4-2-3-5-12(11)15/h6-9,16H,2-5H2,1H3
charge 0 multiplicity 1
33 atoms
O  -1.011483 1.745362 0.866585
O  3.451902 0.968946 0.828148
O  4.707668 -1.094585 -0.332828
C  -4.553013 -0.360138 -0.178206
C  -4.624055 0.921202 0.675658
C  -3.40809 -0.237234 -1.208341
C  -3.284809 1.150797 1.408725
C  -2.032939 0.05945 -0.586754
C  -2.020562 1.036684 0.539968
C  -0.939998 -0.615477 -1.116419
C  0.50608 -0.67155 -0.873803
C  1.262042 0.2555 -0.092121
C  1.207117 -1.74772 -1.498124
C  2.649552 0.102684 0.08238
C  2.593818 -1.907304 -1.325283
C  3.32809 -0.993824 -0.535938
C  2.779462 2.110335 1.463236
H  -5.511316 -0.526218 -0.706504
H  -4.38238 -1.238745 0.475532
H  -5.446375 0.860931 1.413437
H  -4.844267 1.785896 0.018047
H  -3.668401 0.588078 -1.905948
H  -3.345126 -1.155045 -1.822817
H  -3.174524 0.3797 2.201981
H  -3.249418 2.131152 1.91573
H  -1.232626 -1.342566 -1.893475
H  0.722934 1.09648 0.350585
H  0.655208 -2.4699 -2.110863
H  3.115254 -2.745407 -1.806251
H  5.070647 -1.877934 -0.818191
H  2.004712 1.773884 2.177601
H  2.313693 2.772018 0.708562
H  3.578702 2.647048 1.994594
