program: Gaussian 09
title: 000294797
version: EM64L-G09RevD.01
frameworkgroup: C1[X(C15H21NO4)]
method: RPBEPBE
basis: SDD
operation: Freq
keyword: #p
keyword: freq=noraman
keyword: PBEPBE/SDD
title: #p freq=noraman PBEPBE/SDD
converged: YES YES NO NO
title: Mulliken charges:
elementType: O O O O N C C C C C C C C C C C C C C C H H H H H H H H H H H H H H H H H H H H H
charge: -0.409686 -0.248155 -0.306570 -0.301234 -0.140433 -0.113250 -0.485382 -0.375809 -0.457509 -0.396948 -0.562022 0.187965 0.561801 -0.528479 -0.444380 0.214641 -0.337038 0.175061 -0.530135 -0.530491 0.236185 0.231020 0.257775 0.224260 0.206574 0.230915 0.213974 0.208022 0.258016 0.209327 0.223643 0.264055 0.233077 0.378111 0.246166 0.228375 0.223434 0.251969 0.227533 0.221430 0.254192
chargesum: 0.00000
title: Mulliken charges with hydrogens summed into heavy atoms:
elementType: O O O O N C C C C C C C C C C C C C C C
charge: -0.031575 -0.248155 -0.306570 -0.301234 -0.140433 0.122934 0.003414 0.055025 -0.012621 0.069089 -0.129051 0.187965 0.561801 -0.264424 -0.211303 0.214641 -0.090872 0.175061 0.173643 0.172665
polarizability: 2.39187652e+02 -1.13503325e+01 1.86542420e+02 -1.08172767e+01 -3.81301226e-02 1.23268297e+02
1716.lowfreq: -0.0007 -0.0003 -0.0003 2.0380 5.7878 12.4310 17.2550 24.9137 35.2691
frequency: 16.9617 24.6937 35.2338 43.4519 51.3134 63.0993 86.5687 106.5965 116.4253 128.6787 156.7951 165.6974 170.6135 179.2312 185.3330 237.6436 261.4648 277.2797 288.7775 318.9104 346.5852 372.6700 401.0726 406.9964 443.1870 488.6734 516.2306 546.1439 575.0158 582.1466 596.1617 606.7096 651.8876 697.8997 708.5882 735.1229 748.9745 778.1874 790.7101 835.0004 854.6023 859.7147 886.6492 890.1069 903.2489 927.1261 945.9769 953.0530 953.6306 978.4543 1026.1119 1028.7627 1035.8319 1087.7141 1093.2419 1106.3642 1114.0475 1114.9140 1115.5373 1137.3543 1138.6431 1153.3380 1157.2968 1177.4115 1194.0429 1207.8256 1218.0743 1242.1687 1245.3039 1259.0132 1277.0209 1291.0211 1297.0633 1302.3142 1306.6026 1317.4949 1331.5096 1343.4106 1366.3443 1378.9615 1401.4858 1423.9226 1442.8608 1457.4310 1459.4983 1464.7688 1469.0324 1474.5600 1478.0413 1479.4661 1484.7699 1488.1493 1497.4995 1574.5934 1613.2967 1643.8501 2865.2527 2912.3199 2953.0632 2970.1298 2972.2395 2992.6569 2993.9078 3008.9728 3032.4882 3033.7708 3058.7557 3066.5710 3068.4269 3074.2977 3102.2458 3118.7340 3120.0858 3125.7649 3139.3768 3160.1506 3505.5953
redmass: 4.7676 5.5497 4.8198 4.9821 5.0605 2.7083 3.6433 2.9306 3.1678 3.5897 1.9919 1.1189 1.5693 2.5493 2.2915 4.4038 3.9721 3.3013 3.0182 4.2135 4.2196 2.9325 6.2886 4.9239 4.1236 3.5193 5.2186 2.4456 4.5691 2.5623 1.4882 3.4521 3.9337 3.7760 5.8684 4.0656 3.4794 2.9523 1.2925 1.5729 3.2629 1.8920 4.3638 1.6431 1.6062 2.3931 4.9316 1.9339 1.5358 3.8457 1.8127 3.3222 2.3465 2.6694 2.0271 1.6120 1.2681 2.0218 1.3266 2.1230 1.4959 1.3325 1.4913 1.4039 1.7973 1.4894 2.2391 1.4430 2.2594 1.6685 1.3323 1.4431 1.1628 1.4144 1.8329 1.7736 1.3906 1.4273 5.9579 1.3391 2.2825 1.1762 1.3668 1.0562 1.0686 1.0907 1.0861 1.0952 1.0870 1.0997 2.5991 1.0617 1.0885 7.2312 6.7541 8.4263 1.0700 1.0832 1.0584 1.0308 1.0310 1.0873 1.0654 1.0744 1.0615 1.0903 1.1020 1.1036 1.1038 1.1022 1.1051 1.1028 1.1026 1.0889 1.0918 1.0955 1.0639
irintensity: 0.1866 0.5297 1.5527 0.6176 0.6496 1.6075 3.5944 6.8044 1.8745 1.7967 1.2928 0.0641 0.1050 6.0136 2.5454 5.4123 6.9172 1.5536 4.4855 2.5294 0.3537 2.2819 2.4892 4.0541 6.1450 8.8290 18.7041 25.1537 12.4436 35.9147 89.5961 15.0994 14.5150 69.8567 12.6975 0.9533 3.6393 17.8071 4.8760 44.6865 30.5310 2.7581 12.9325 7.2691 12.0665 5.5486 50.5567 38.8970 12.0126 61.1151 9.0201 7.6315 47.9241 11.5651 117.4978 22.6473 19.4359 58.4541 3.4370 78.4881 2.8089 0.3664 7.6022 19.2283 47.4017 4.9065 11.1431 38.1983 69.0275 38.4846 5.5956 8.1268 15.9366 7.0266 12.9114 25.3366 10.9492 7.3920 7.9398 7.8632 16.3768 1.0344 15.6492 13.5476 8.1428 0.7472 9.6653 10.2376 13.9194 13.8429 118.5944 34.0625 1.4011 7.2092 6.4382 206.9530 75.2923 59.8619 60.9428 94.6246 56.5473 7.3098 52.3791 54.7873 22.6150 2.7321 25.8014 32.0435 23.5243 40.0991 28.2869 26.3289 24.9367 13.6750 4.8855 9.3992 21.4185
temp: 298.150 k
press: 1.00000 atm
elementType: 8 8 8 8 7 6 6 6 6 6 6 6 6 6 6 6 6 6 6 6 1 1 1 1 1 1 1 1 1 1 1 1 1 1 1 1 1 1 1 1 1
symmnumber: 1
zpe: 885763.3 jmol-1
zpe.correction: 0.337369 hartree
zpe.thermalcorrener: 0.358316 hartree
zpe.thermalcorrenthalpy: 0.359261 hartree
zpe.thermalcorrgfe: 0.284594 hartree
zpe.sumelectzpe: -938.263440 hartree
zpe.sumelectthermal: -938.242493 hartree
zpe.sumelectthermalent: -938.241549 hartree
zpe.sumelectthermalfe: -938.316216 hartree
dipole: 1.3259 -1.4039 0.2402
dipole: 1.9459
quadrupole: -101.6255 -115.5681 -117.7043
quadrupole: -6.1076 1.8872 -0.6901
quadrupole: 10.0071 -3.9355 -6.0716 -6.1076 1.8872 -0.6901
hfenergy: -938.6008096 hartree
pointgroup: C01 [X(C15H21N1O4)]
dipole: -0.5120193 0.5565492 0.1191397 debye
polarizability: 238.5126561|-12.9534095|186.8421893|11.2918877|3.0792414|123.6435234 unknown
InChI: InChI=1S/C15H21NO4/c1-19-13-6-5-11(10-14(13)20-2)7-9-16-8-3-4-12(16)15(17)18/h5-6,10,12,17H,3-4,7-9H2,1-2H3
charge 0 multiplicity 1
41 atoms
O  -4.554323 -1.713472 -1.365161
O  -2.839702 -2.584137 -0.071692
O  3.548329 -1.853146 -0.255733
O  5.11367 0.494201 0.532116
N  -2.828715 0.620772 -0.092897
C  -3.75275 -0.37228 0.525627
C  -5.128576 0.33246 0.535095
C  -3.450019 1.977605 -0.067507
C  -4.746612 1.815667 0.767516
C  -1.402084 0.510147 0.253293
C  -0.477173 0.997298 -0.896527
C  -3.661112 -1.662301 -0.289068
C  0.995731 0.863982 -0.540482
C  1.625027 -0.406883 -0.558473
C  1.760763 1.987371 -0.135708
C  2.978438 -0.557485 -0.195366
C  3.124107 1.850931 0.208486
C  3.747937 0.586803 0.166268
C  4.011811 -2.379705 1.049252
C  6.008952 0.026481 -0.552057
H  -3.440172 -0.638448 1.561768
H  -5.793777 -0.073028 1.315676
H  -5.619915 0.204131 -0.443532
H  -3.678786 2.328681 -1.09315
H  -2.75355 2.710356 0.390872
H  -5.544332 2.511528 0.456202
H  -4.536733 1.99301 1.839033
H  -1.155976 1.085124 1.181155
H  -1.177808 -0.552237 0.4607
H  -0.715991 2.052423 -1.129938
H  -0.724138 0.40215 -1.795499
H  1.070534 -1.30655 -0.84993
H  1.291901 2.978188 -0.106516
H  -4.368864 -2.536015 -1.895207
H  3.729503 2.71515 0.500958
H  4.460368 -3.360064 0.827149
H  3.151483 -2.506158 1.733593
H  4.758143 -1.704667 1.505985
H  7.01142 -0.029333 -0.100669
H  6.010386 0.756413 -1.383936
H  5.694406 -0.96476 -0.925395
