program: Gaussian 09
title: 000003558
version: EM64L-G09RevD.01
frameworkgroup: C1[X(C10H15Br2Cl3)]
method: RPBEPBE
basis: SDD
operation: Freq
keyword: #p
keyword: freq=noraman
keyword: PBEPBE/SDD
title: #p freq=noraman PBEPBE/SDD
converged: YES YES NO NO
title: Mulliken charges:
elementType: Br Br Cl Cl Cl C C C C C C C C C C H H H H H H H H H H H H H H H
charge: -0.049907 0.003390 -0.080772 -0.035165 -0.040859 -0.360589 -0.460779 -0.371894 -0.015744 -0.116582 -0.649380 -0.666211 -0.691338 0.184891 -0.564001 0.259360 0.251831 0.321781 0.258911 0.243688 0.239677 0.242324 0.240314 0.235900 0.247396 0.239340 0.324362 0.312091 0.252175 0.245791
chargesum: 0.00000
title: Mulliken charges with hydrogens summed into heavy atoms:
elementType: Br Br Cl Cl Cl C C C C C C C C C C
charge: -0.049907 0.003390 -0.080772 -0.035165 -0.040859 0.150602 -0.138998 0.130705 -0.015744 -0.116582 0.072934 0.056426 -0.054885 0.184891 -0.066035
polarizability: 1.71410719e+02 1.06684111e+00 1.95363782e+02 3.21585970e-01 -1.55721703e+01 1.40964123e+02
1716.lowfreq: -9.4443 -3.4331 0.0006 0.0019 0.0022 3.2836 12.9532 26.3960 49.2184
frequency: 11.7145 26.3344 49.2163 54.1136 57.6856 75.3638 111.5908 117.4027 137.6263 165.1649 193.5674 205.8800 214.2146 220.8763 229.2679 253.5942 267.8217 279.5608 315.7668 320.9534 336.0399 368.2321 395.8745 414.0665 458.9464 491.6380 519.5635 523.9898 578.9915 588.5867 619.0927 640.4577 687.9110 774.2063 816.8360 822.0572 879.4667 931.6192 940.3879 963.1493 983.3455 1003.0799 1005.9415 1068.1001 1091.9200 1099.8753 1110.9468 1142.2624 1159.8809 1196.1469 1225.9632 1238.0791 1244.5444 1246.2925 1288.0060 1308.1765 1347.3432 1372.8879 1387.0385 1401.4852 1405.8901 1439.1779 1451.1754 1452.9603 1457.7901 1461.0795 1471.7720 1484.9967 1637.7023 2985.2248 2995.0674 2998.0944 3000.4984 3049.4192 3064.8460 3076.1944 3087.9450 3091.9010 3096.4136 3108.1358 3115.5262 3127.9975 3174.6319 3233.7700
redmass: 15.2779 12.3969 13.2404 5.2348 7.0370 6.7601 17.3043 7.0926 4.9792 8.8133 3.3910 2.8314 2.4386 4.9514 2.0262 1.5569 2.9053 1.9213 3.7845 2.8524 3.2693 2.9887 3.6676 3.1970 5.8367 3.7789 4.0818 3.4042 5.2881 3.0065 3.1597 3.1997 1.2418 3.0398 2.3738 1.6641 1.8141 1.3457 1.4509 2.2793 1.8531 1.4325 1.5795 2.3430 2.3771 1.5368 1.6308 1.4301 2.3183 2.6148 1.4350 1.2132 1.6288 2.7930 1.5844 1.1336 1.4134 1.5018 1.2219 1.1935 1.1773 1.0834 1.0709 1.0600 1.0649 1.0708 1.0588 1.0519 5.7196 1.0594 1.0369 1.0366 1.0585 1.0975 1.0938 1.0974 1.0569 1.0972 1.0988 1.1006 1.1003 1.0629 1.1111 1.1150
irintensity: 0.0921 0.0622 0.4691 0.3869 1.6865 0.4295 0.4395 2.8021 3.1224 4.5208 0.3564 1.7462 1.8008 0.3313 3.3885 0.2141 3.7950 1.6909 3.6323 1.6450 4.9469 3.5840 6.2957 5.0830 12.5458 2.6571 22.6058 49.8342 74.2817 1.7398 5.3367 7.7793 2.8086 13.4731 8.7095 53.3650 8.6503 51.3383 0.6759 10.9481 7.1508 6.9996 3.5973 7.8773 9.2586 41.8174 52.3598 2.3995 5.7389 13.1996 28.4400 5.9573 22.4411 32.2931 16.9374 0.5734 3.8011 0.3005 32.2829 25.2301 27.6302 26.0458 5.1053 9.3568 4.6897 3.5135 12.7101 16.4458 23.2121 2.1370 9.2061 7.8271 14.7742 1.0728 0.7933 12.2449 3.7777 6.8689 14.0987 14.3338 26.1910 0.6494 0.2734 2.1886
temp: 298.150 k
press: 1.00000 atm
elementType: 35 35 17 17 17 6 6 6 6 6 6 6 6 6 6 1 1 1 1 1 1 1 1 1 1 1 1 1 1 1
symmnumber: 1
zpe: 594833.3 jmol-1
zpe.correction: 0.226560 hartree
zpe.thermalcorrener: 0.245888 hartree
zpe.thermalcorrenthalpy: 0.246832 hartree
zpe.thermalcorrgfe: 0.174924 hartree
zpe.sumelectzpe: -1795.968132 hartree
zpe.sumelectthermal: -1795.948804 hartree
zpe.sumelectthermalent: -1795.947860 hartree
zpe.sumelectthermalfe: -1796.019768 hartree
dipole: -2.0691 -0.9376 0.6713
dipole: 2.3687
quadrupole: -132.2280 -144.7434 -124.3944
quadrupole: 1.2034 4.7705 -0.6040
quadrupole: 1.5606 -10.9548 9.3942 1.2034 4.7705 -0.6040
hfenergy: -1796.1946923 hartree
pointgroup: C01 [X(C10H15Br2Cl3)]
dipole: 0.7605837 -0.4512656 -0.2938955 debye
polarizability: 171.074159|1.1978372|198.9945925|-3.3298691|5.6453006|137.669873 unknown
InChI: InChI=1S/C10H15Br2Cl3/c1-7(13)10(15,6-11)5-4-8(12)9(2,3)14/h8H,1,4-6H2,2-3H3
charge 0 multiplicity 1
30 atoms
Br 1.983555 -2.361146 -0.863816
Br -2.161898 -1.761146 2.069639
Cl 3.271695 2.05041 0.024313
Cl -1.658546 2.340301 -0.062165
Cl -4.671058 0.723289 -0.026749
C  0.712461 0.056381 0.238399
C  1.975824 -0.304165 -0.555212
C  -0.582885 -0.223665 -0.551045
C  3.334041 0.084993 0.082086
C  -1.861413 0.385029 0.064945
C  4.551645 -0.283706 -0.7755
C  3.497847 -0.294646 1.55668
C  -2.007611 0.205958 1.5819
C  -3.109741 0.056127 -0.727056
C  -3.189809 -0.667746 -1.864983
H  0.705141 -0.499491 1.192949
H  0.779987 1.139049 0.464949
H  1.933326 0.078747 -1.589146
H  -0.73093 -1.317797 -0.619831
H  -0.481285 0.16637 -1.580578
H  4.724544 -1.373738 -0.734511
H  5.449056 0.229439 -0.392697
H  4.404555 0.007313 -1.829518
H  3.4681 -1.39601 1.655225
H  2.704188 0.136364 2.18737
H  4.469485 0.064731 1.933407
H  -2.928054 0.669119 1.960204
H  -1.126359 0.574667 2.121642
H  -4.147553 -0.85687 -2.356221
H  -2.295306 -1.099359 -2.32238
