program: Gaussian 09
title: 000294785
version: EM64L-G09RevD.01
frameworkgroup: C1[X(C17H16ClNO3S)]
method: RPBEPBE
basis: SDD
operation: Freq
keyword: #p
keyword: freq=noraman
keyword: PBEPBE/SDD
title: #p freq=noraman PBEPBE/SDD
converged: YES YES NO NO
title: Mulliken charges:
elementType: Cl S O O O N C C C C C C C C C C C C C C C C C H H H H H H H H H H H H H H H H
charge: -0.052268 0.910435 -0.518742 -0.519668 -0.190997 -0.421128 0.227875 -0.542505 -0.608646 0.479744 -0.480167 0.212859 -0.034174 -0.274069 -0.427720 -0.119603 -0.228036 -0.245903 -0.244145 0.450944 -0.332327 -0.394069 -0.798208 0.308593 0.265601 0.290915 0.226788 0.228258 0.260051 0.294292 0.245109 0.260192 0.289384 0.281501 0.244802 0.246051 0.229516 0.241820 0.237645
chargesum: 0.00000
title: Mulliken charges with hydrogens summed into heavy atoms:
elementType: Cl S O O O N C C C C C C C C C C C C C C C C C
charge: -0.052268 0.910435 -0.518742 -0.519668 -0.190997 -0.421128 0.227875 0.031690 -0.090943 0.479744 0.008142 0.212859 -0.034174 0.020222 -0.182611 -0.119603 0.032156 0.043481 0.037355 0.450944 -0.087525 -0.148017 -0.089227
polarizability: 2.96725480e+02 2.08585633e+01 2.39894443e+02 -1.62127329e+01 2.29914936e+01 1.74510487e+02
1716.lowfreq: -10.1241 -4.5702 -0.0015 -0.0014 0.0012 4.5249 8.5863 13.5056 24.7481
frequency: -6.0511 13.2474 24.7155 31.2392 41.2741 65.7129 75.3296 95.2324 118.0583 139.9543 143.2838 182.5188 188.9141 215.3676 220.7238 229.8570 264.6603 284.5009 303.4000 305.5326 336.0631 339.9606 378.7090 386.1645 390.3947 403.2169 407.5080 421.4187 446.1695 487.4615 508.0524 515.8625 568.9606 584.8980 593.8422 621.2680 623.6653 657.5857 706.9893 714.6530 745.8261 751.6238 776.6021 802.3496 814.4012 826.9179 828.1718 850.7088 862.6807 903.5951 929.2051 931.9187 957.0844 962.6487 981.6066 983.9122 987.8321 996.5144 1028.8327 1043.3606 1050.0057 1055.3729 1075.4348 1120.8825 1122.4599 1154.2330 1174.1254 1187.2538 1196.6454 1218.5071 1234.0630 1250.5102 1257.7817 1278.6118 1299.7820 1308.3870 1333.9753 1347.3949 1365.3206 1380.5206 1386.9548 1392.2865 1400.8372 1408.6062 1435.3826 1462.3484 1469.9673 1474.4705 1474.9840 1489.0103 1562.1478 1588.0330 1594.2425 1595.6591 1613.1823 2961.5444 2968.5783 2983.8911 2995.3073 3044.2698 3056.6720 3063.7102 3063.8331 3094.8663 3135.8993 3137.2089 3140.1798 3163.9076 3166.8603 3172.1817 3178.3351
redmass: 1.0724 5.3852 6.8575 9.4811 3.9929 6.4825 5.0635 4.1457 5.5235 6.6969 5.2723 7.3331 5.1742 6.2566 5.7127 5.5940 4.3680 5.0647 5.1573 4.4375 5.6928 4.1305 3.6576 3.9227 9.1385 4.0124 2.8667 2.9415 5.9650 3.2587 3.1345 5.5236 5.4181 4.1989 4.9599 6.7704 4.4747 6.2969 3.3041 4.4509 3.0348 3.4648 5.2023 9.9184 2.3700 1.4040 1.6803 1.2544 2.6214 1.5609 4.5623 2.5126 1.3762 1.3110 2.6835 1.3789 1.7997 2.9683 3.8029 3.0458 1.5870 2.5038 2.2480 1.3570 1.6018 1.4116 1.5786 1.1362 2.4826 3.0541 2.3178 1.2120 1.5993 1.6732 1.2590 1.3736 1.3055 1.5460 5.6537 4.5342 2.6761 3.0243 1.3075 1.1483 1.0936 2.6883 1.0484 1.9585 1.2211 1.0878 7.6775 7.0335 6.4337 6.3958 9.2721 1.0639 1.0660 1.0377 1.0616 1.0949 1.1015 1.0972 1.0941 1.0990 1.0896 1.0894 1.0893 1.0954 1.0969 1.0954 1.0933
irintensity: 0.5407 1.4733 1.2580 2.4258 0.6103 0.8669 0.6081 1.5456 0.8971 0.4730 2.2132 0.6101 0.8993 10.3396 1.3349 22.0620 3.6094 4.5114 2.7574 1.7331 2.2609 11.1052 4.5964 0.5880 15.7731 2.3305 0.0333 2.4438 91.3145 8.1096 54.1224 32.3427 9.2537 5.0012 50.6170 0.7943 20.0229 17.7674 0.7171 1.9357 0.4499 12.2549 10.2425 79.0287 3.1091 65.1177 21.7340 2.7759 8.9682 20.1295 53.5816 14.8739 1.1429 0.9890 19.8507 0.3350 1.9974 5.7644 38.6693 15.6314 12.5810 24.8081 31.8896 14.8062 4.0438 33.7154 12.7043 11.3797 5.1490 6.2997 1.2328 12.9345 8.7747 9.7309 2.9236 7.5510 2.0766 6.4894 1.0414 2.9699 2.5276 10.8931 17.3889 32.3460 22.1143 77.6763 14.9425 23.5795 15.1074 17.6715 10.9090 11.8376 8.2525 4.5078 149.6772 3.2233 16.9351 22.0092 18.4042 1.9446 7.9434 14.7841 19.5761 16.5207 9.9473 10.0232 8.6212 0.5566 8.4899 3.4962 0.1440
temp: 298.150 k
press: 1.00000 atm
elementType: 17 16 8 8 8 7 6 6 6 6 6 6 6 6 6 6 6 6 6 6 6 6 6 1 1 1 1 1 1 1 1 1 1 1 1 1 1 1 1
symmnumber: 1
zpe: 760159.7 jmol-1
zpe.correction: 0.289530 hartree
zpe.thermalcorrener: 0.310991 hartree
zpe.thermalcorrenthalpy: 0.311936 hartree
zpe.thermalcorrgfe: 0.236736 hartree
zpe.sumelectzpe: -1794.121370 hartree
zpe.sumelectthermal: -1794.099908 hartree
zpe.sumelectthermalent: -1794.098964 hartree
zpe.sumelectthermalfe: -1794.174164 hartree
dipole: 4.5446 5.0041 -0.0632
dipole: 6.7601
quadrupole: -136.2447 -164.8121 -147.0195
quadrupole: -24.5208 -5.0208 9.2994
quadrupole: 13.1141 -15.4534 2.3393 -24.5208 -5.0208 9.2994
hfenergy: -1794.4108998 hartree
pointgroup: C01 [X(C17H16Cl1N1O3S1)]
dipole: 1.1578458 -2.3884325 0.1684348 debye
polarizability: 281.284614|-31.3355626|257.7314134|23.0569478|12.3569799|172.1143837 unknown
InChI: InChI=1S/C17H16ClNO3S/c1-12-2-8-16(9-3-12)23(21,22)19-11-15(20)7-5-13-4-6-14(18)10-17(13)19/h2-4,6,8-10H,5,7,11H2,1H3
charge 0 multiplicity 1
39 atoms
Cl 0.671887 -4.119573 1.28253
S  0.162568 1.83744 -0.423982
O  0.222929 3.335464 0.211151
O  -0.317574 1.601434 -1.970685
O  -3.859626 3.066752 1.083598
N  -0.903337 0.818474 0.873648
C  -1.164779 -0.527546 0.451527
C  -1.935493 1.679753 1.488369
C  -3.138475 0.146045 -1.055787
C  -2.222999 -0.89478 -0.437966
C  -4.013471 0.921709 -0.032083
C  -3.302239 1.967938 0.820227
C  1.829882 1.000038 -0.219164
C  -0.279516 -1.513423 0.966369
C  -2.379563 -2.267123 -0.750585
C  -0.466723 -2.859192 0.615629
C  -1.513951 -3.25887 -0.236052
C  2.232827 0.077513 -1.197944
C  2.622943 1.363118 0.880114
C  4.343275 -0.200944 0.050944
C  3.501584 -0.521678 -1.0483
C  3.889629 0.749684 1.003838
C  5.701007 -0.86283 0.19513
H  -1.469333 2.662739 1.690228
H  -2.156506 1.224759 2.477592
H  -2.539473 0.863286 -1.648281
H  -3.822341 -0.359441 -1.760612
H  -4.489414 0.196384 0.662203
H  -4.831183 1.448353 -0.55529
H  0.52207 -1.1993 1.63972
H  -3.187817 -2.570219 -1.425792
H  -1.64816 -4.312396 -0.497512
H  1.581842 -0.145239 -2.049233
H  2.273725 2.110499 1.599416
H  3.842264 -1.247168 -1.795968
H  4.533526 1.016436 1.849296
H  6.275134 -0.436651 1.034572
H  5.594892 -1.949011 0.375958
H  6.303087 -0.744435 -0.724221
