program: Gaussian 09
title: 000294723
version: EM64L-G09RevD.01
frameworkgroup: C1[X(C9H13NO3)]
method: RPBEPBE
basis: SDD
operation: Freq
keyword: #p
keyword: freq=noraman
keyword: PBEPBE/SDD
title: #p freq=noraman PBEPBE/SDD
converged: YES YES NO NO
title: Mulliken charges:
elementType: O O O N C C C C C C C C C H H H H H H H H H H H H H
charge: -0.257819 -0.273553 -0.246125 -0.164035 -0.075103 -0.396552 -0.279019 0.239527 -0.607456 -0.310180 -0.004700 0.017899 -0.741840 0.254470 0.237910 0.259790 0.203797 0.223466 0.230741 0.226910 0.268414 0.222539 0.216349 0.250250 0.252214 0.252106
chargesum: 0.00000
title: Mulliken charges with hydrogens summed into heavy atoms:
elementType: O O O N C C C C C C C C C
charge: -0.257819 -0.273553 -0.246125 -0.164035 0.179367 0.101149 0.148244 0.239527 0.118609 0.128708 -0.004700 0.017899 0.012730
polarizability: 1.59901621e+02 1.50698559e+01 1.00309565e+02 1.24107416e+01 3.39967707e+00 7.98294594e+01
1716.lowfreq: -12.6499 -1.7471 -0.0005 0.0003 0.0004 4.0976 21.0538 26.3433 42.4794
frequency: 20.8441 26.1766 42.4329 50.3266 80.8348 107.1134 129.8923 145.0515 181.2063 192.6275 198.7760 261.6222 279.3885 300.3249 357.7859 364.4883 430.4332 476.8078 524.6025 619.2397 679.8241 708.3324 763.4072 772.8520 861.1776 909.7834 927.3112 969.0799 979.5521 992.0169 1022.9325 1031.3303 1034.2197 1054.9196 1097.6428 1102.9678 1139.4935 1172.5004 1183.5777 1196.0479 1210.3609 1256.3393 1267.2907 1277.6401 1325.1012 1352.4387 1383.1578 1398.7566 1402.3796 1430.9111 1460.0913 1463.3226 1464.8328 1475.9330 1481.0672 1486.4360 1505.7898 1720.2373 2295.7047 2919.0942 2938.7261 2960.4881 2964.4915 2973.5230 2978.8705 3001.6109 3042.6500 3054.8364 3068.0149 3069.3183 3090.7955 3102.5133
redmass: 4.2496 1.0209 3.8159 3.7791 4.0995 4.8374 2.6681 1.3173 2.7432 3.2800 2.8604 5.3247 3.2541 3.5037 4.2818 5.1293 2.9044 5.3933 4.5327 6.4008 11.5667 7.1471 6.1566 3.8752 2.9554 6.4405 1.7620 4.3418 2.2250 1.8617 7.9518 1.4339 1.3925 2.1860 1.6552 1.3647 1.5031 1.1928 3.4794 1.0712 1.4498 1.9443 1.7311 2.2762 1.3157 1.4384 2.2930 1.5097 1.2216 1.1737 1.0409 1.0462 1.0845 1.0445 1.0744 1.0733 1.1065 10.6659 11.6770 1.0546 1.0573 1.1044 1.0380 1.0639 1.0351 1.1043 1.1003 1.0989 1.0982 1.0988 1.0895 1.0984
irintensity: 1.2167 0.0480 0.5735 1.1866 4.3870 13.6471 11.7992 0.1466 0.5432 11.5566 8.6819 0.7499 7.9034 2.2141 0.4307 3.9779 2.2768 0.8684 0.8912 23.6374 13.8402 6.4310 2.3270 4.8125 7.4999 41.8378 10.4775 130.5211 11.1342 12.6688 212.1139 4.9240 6.2702 83.0436 25.5248 12.8074 1.6247 13.9060 13.5862 6.4045 39.4278 5.9042 67.4556 30.6667 55.6433 11.5226 43.7403 17.2958 6.8596 39.7534 14.1112 15.0623 2.6941 17.9806 13.2586 7.3747 13.1459 515.4860 31.6657 42.4742 60.6285 38.8779 54.2771 61.4965 30.1509 35.8714 41.0004 13.4109 13.0109 13.8189 27.3132 3.2258
temp: 298.150 k
press: 1.00000 atm
elementType: 8 8 8 7 6 6 6 6 6 6 6 6 6 1 1 1 1 1 1 1 1 1 1 1 1 1
symmnumber: 1
zpe: 545566.9 jmol-1
zpe.correction: 0.207795 hartree
zpe.thermalcorrener: 0.222646 hartree
zpe.thermalcorrenthalpy: 0.223590 hartree
zpe.thermalcorrgfe: 0.162744 hartree
zpe.sumelectzpe: -630.099683 hartree
zpe.sumelectthermal: -630.084832 hartree
zpe.sumelectthermalent: -630.083888 hartree
zpe.sumelectthermalfe: -630.144734 hartree
dipole: 5.2682 3.1850 -0.0486
dipole: 6.1563
quadrupole: -85.1640 -72.7719 -74.5967
quadrupole: -11.4418 -3.3467 1.2829
quadrupole: -7.6531 4.7390 2.9141 -11.4418 -3.3467 1.2829
hfenergy: -630.307478 hartree
pointgroup: C01[X(C9H13N1O3)]
dipole: -1.844262 0.5702441 -1.4628766 debye
dipolederiv: -1.2790324 -0.3074703 0.0306911 -0.482837 -0.5798989 0.1301489 0.1234531 0.1192351 -0.4444268 -1.297657 0.1064001 -0.169758 0.2419298 -0.4245086 0.055766 -0.0413534 0.0198537 -0.3991251 -1.1259904 -0.0980757 -0.466616 -0.2716291 -0.4239685 -0.0636251 -0.3595146 0.0342223 -0.7547574 -0.6553689 -0.0546262 -0.2174807 -0.0762032 -0.5202599 0.2927344 -0.0380267 0.2562782 -0.9719461 0.6884963 0.0257231 -0.0209054 -0.0949801 0.3088242 0.0079308 0.1207711 0.1094989 0.2268334 0.3435692 -0.0194541 0.2169019 0.0226441 0.2420614 0.2643631 0.0902574 0.2136386 0.1314983 0.632577 0.05999 0.1399683 0.1035485 0.2936573 -0.0490621 0.3367356 -0.1386334 0.3422033 1.7597362 0.342119 0.651823 0.743591 0.7101016 -0.3140043 0.2883221 -0.4485178 1.4792087 0.202126 0.0487729 -0.2417068 0.0448657 0.3760732 -0.1830025 -0.2439611 -0.1200373 0.3183129 1.2194257 -0.1192781 0.1807691 -0.2938269 0.4967438 -0.0581463 -0.0937462 0.0029529 0.4489865 -0.4651327 0.0482958 -0.1028468 0.0204618 -0.1532947 -0.0309002 -0.2003392 0.009352 -0.2841813 0.0876444 -0.0166195 0.1635815 0.0015774 -0.1426616 0.0193067 0.1978123 0.000771 0.0242438 0.0376398 0.010121 -0.0407996 0.0293143 0.0997211 0.0068844 -0.0406385 0.0031033 0.059582 0.0008615 -0.0551198 0.0022904 -0.056038 -0.0805493 -0.0322065 -0.0121684 -0.0369386 0.0547718 -0.0231522 0.0422693 0.0458298 -0.0240845 -0.0291801 -0.1525419 0.0164264 -0.1215932 -0.0915306 0.0391384 0.0467576 -0.088334 0.1108466 -0.0155823 0.0436448 -0.1149761 0.007917 0.0553811 -0.0464908 -0.0319526 -0.0462439 -0.093206 -0.1522021 -0.0688287 -0.0867344 -0.0035845 0.0264403 -0.0431167 -0.0320043 0.0700826 -0.0182761 0.0251526 0.0898965 -0.0190403 0.0800532 -0.1399765 0.0209683 0.1364197 -0.0190756 0.0513694 -0.0958665 0.1028382 0.0295472 0.0860798 0.0346449 0.0680096 -0.0125769 0.0872178 0.0461291 -0.0074244 -0.1021112 0.1368943 -0.019719 -0.1373793 0.0065869 -0.0720954 -0.0179386 -0.0305749 0.10989 0.0047689 -0.1045908 -0.0510439 0.0814653 -0.0844151 0.021109 -0.0285765 0.0278997 0.0164147 0.1322052 0.082616 0.0589805 -0.1346356 -0.0963032 -0.0684179 -0.0840553 0.0240151 -0.1420794 -0.0826075 0.0125363 -0.0617979 0.0294476 -0.0633284 0.0947402 -0.0124266 0.1119622 0.0439655 -0.039238 0.0108327 -0.053482 0.0707711 0.0260095 -0.0687725 -0.0638769 -0.1116966 -0.0652685 -0.0361309 -0.0674414 -0.0056948 0.0803074 0.0471989 -0.0262542 0.0314853 -0.0268025 0.1101392 0.0619172 -0.0236733 0.0591058 -0.1061396 unknown
polarizability: 152.4679027|4.2409927|80.3928903|27.4317583|-5.033679|107.1798529 unknown
InChI: InChI=1S/C9H13NO3/c1-3-4-5-12-7-8-6-10(2)9(11)13-8/h8H,5-7H2,1-2H3
charge 0 multiplicity 1
26 atoms
O  2.365242 -0.918956 1.668967
O  -1.064209 -0.129889 0.503038
O  4.388351 0.279103 1.836924
N  2.941324 0.487827 -0.037194
C  1.197519 -0.875675 0.740288
C  1.733304 -0.182226 -0.542942
C  0.072745 -0.094911 1.430718
C  3.354997 0.004754 1.197946
C  3.766672 1.3788 -0.847502
C  -2.258134 0.52425 1.088266
C  -3.361258 0.498309 0.125491
C  -4.312349 0.49127 -0.659967
C  -5.439624 0.479874 -1.603802
H  0.878042 -1.912651 0.556201
H  1.983067 -0.914446 -1.336824
H  0.990712 0.530483 -0.941972
H  0.392515 0.951776 1.631545
H  -0.179201 -0.580632 2.396495
H  3.202615 2.282565 -1.143864
H  4.128331 0.87127 -1.763597
H  4.637535 1.680979 -0.242904
H  -2.545265 -0.008717 2.021767
H  -2.006463 1.573902 1.360258
H  -6.242961 1.161433 -1.268491
H  -5.872827 -0.532404 -1.699008
H  -5.118377 0.808314 -2.609133
