program: Gaussian 09
title: 000294784
version: EM64L-G09RevD.01
frameworkgroup: C1[X(C19H21NO5S)]
method: RPBEPBE
basis: SDD
operation: Freq
keyword: #p
keyword: freq=noraman
keyword: PBEPBE/SDD
title: #p freq=noraman PBEPBE/SDD
converged: YES YES NO NO
title: Mulliken charges:
elementType: S O O O O O N C C C C C C C C C C C C C C C C C C C H H H H H H H H H H H H H H H H H H H H H
charge: 0.872137 -0.535899 -0.517282 -0.234681 -0.271026 -0.280441 -0.291640 -0.476344 -0.396718 0.194399 -0.487549 0.263928 0.096855 -0.453436 -0.056015 -0.501120 0.200738 0.239197 -0.224374 -0.246915 -0.391110 -0.339287 0.452035 -0.800867 -0.507085 -0.536732 0.273363 0.236884 0.261204 0.216077 0.249868 0.213513 0.300958 0.296806 0.292742 0.279253 0.242274 0.241020 0.238853 0.229352 0.233874 0.256249 0.218280 0.230985 0.242842 0.231300 0.243535
chargesum: 0.00000
title: Mulliken charges with hydrogens summed into heavy atoms:
elementType: S O O O O O N C C C C C C C C C C C C C C C C C C C
charge: 0.872137 -0.535899 -0.517282 -0.234681 -0.271026 -0.280441 -0.291640 0.033903 0.080563 0.194399 -0.024168 0.263928 0.096855 -0.152479 -0.056015 -0.204314 0.200738 0.239197 0.068368 0.032338 -0.148836 -0.098267 0.452035 -0.098788 0.198429 0.180945
polarizability: 3.53717734e+02 1.20512476e+00 3.31448194e+02 -2.12234954e+01 1.12316246e+01 1.79425321e+02
1716.lowfreq: 0.0006 0.0008 0.0009 4.2234 6.6664 9.4059 15.9318 21.4669 27.9930
frequency: 15.1005 21.4389 27.9206 31.3647 36.8718 43.0204 46.9269 68.0338 85.9766 102.4564 115.9646 133.6048 138.9974 152.0116 162.9913 177.7753 185.2651 197.2548 214.7386 222.1176 256.9865 260.5876 285.4110 294.3202 295.7930 303.9468 323.0438 357.6681 373.0527 383.1473 387.0339 406.9269 416.1656 426.8350 459.0521 464.5137 489.7519 508.0533 518.4384 535.5221 586.4859 622.6976 623.7393 635.9410 659.2186 694.7560 705.4498 706.4194 738.3793 751.4498 776.7492 794.7900 826.1413 848.9181 858.9861 862.9223 886.8859 904.1833 913.8218 916.8340 938.3883 962.9794 974.1270 982.2007 983.3420 986.7700 996.9221 1044.1603 1049.8056 1055.0151 1082.7689 1094.1762 1108.9700 1111.5985 1119.4974 1137.9695 1148.9194 1159.6497 1169.6472 1185.4040 1192.1168 1208.3445 1218.8367 1253.3412 1257.5648 1279.9611 1283.5784 1297.9441 1328.0989 1352.8549 1368.5834 1375.3975 1381.3601 1388.4514 1392.8258 1400.1755 1429.9026 1438.1279 1441.4166 1447.3216 1454.2970 1461.7209 1467.4536 1470.3529 1470.9514 1472.6346 1474.5122 1474.6445 1486.7903 1522.2667 1548.6696 1593.5975 1597.1983 1601.4299 2957.9257 2969.2275 2976.0869 2980.8660 2989.6258 2994.9170 3040.9691 3054.6940 3061.0496 3066.9409 3071.0130 3090.8544 3100.2286 3132.2308 3133.3851 3134.9379 3139.8065 3151.6385 3163.7239 3166.5982 3182.7670
redmass: 4.7542 4.3535 1.7284 1.8295 2.4793 5.3868 3.6280 4.3031 3.5438 3.4081 5.0585 2.5426 3.4345 4.0383 4.8339 4.3309 3.8455 3.1443 3.0844 7.8171 3.3249 1.5531 4.8689 4.6928 4.6690 4.5579 4.1825 3.2112 3.7229 5.4727 5.1553 2.8651 4.9592 5.6355 4.2339 5.0583 3.8845 3.0973 3.2339 4.0216 5.9448 6.9239 4.8268 4.4049 5.6789 6.3024 3.3669 5.9178 3.4313 3.3272 5.4924 11.4725 1.3490 1.2479 1.7785 3.2398 3.7959 1.7742 1.8351 4.3328 2.7357 1.3071 4.9363 6.4659 1.3895 1.7826 3.0499 2.1533 1.5806 2.4732 2.4608 2.3898 1.2412 1.2577 1.2846 1.8023 1.5182 1.3178 2.4944 1.1379 2.0397 2.2334 3.0188 1.3959 1.9072 1.4477 2.8744 1.2613 1.4417 1.4433 5.4987 1.5973 4.7253 3.0217 2.9102 1.3101 1.2118 1.0952 1.2191 1.0896 1.0780 1.0862 1.0491 1.0848 1.0569 1.1820 1.4061 1.5841 2.5373 7.6692 8.7450 6.8210 6.1436 6.9833 1.0669 1.0647 1.0319 1.0378 1.0329 1.0622 1.0959 1.1012 1.0967 1.0933 1.1046 1.0994 1.0992 1.1012 1.0895 1.1056 1.0894 1.0893 1.0953 1.0965 1.0914
irintensity: 0.8871 0.5005 0.0600 0.7686 3.0767 1.0375 4.1980 1.9170 4.4224 2.2332 0.4510 4.6980 0.0931 11.7965 10.5101 8.9790 13.7357 0.5359 2.4928 16.9445 3.0928 0.0851 9.7065 1.0263 0.9519 3.9948 1.6399 6.1477 2.4635 7.3114 7.0146 0.2396 18.4260 42.1683 4.7201 57.8817 1.6751 71.4977 2.6995 35.8642 31.6694 0.6485 11.1596 16.7003 0.5688 3.9451 0.8691 12.9458 25.1437 2.5749 17.3461 80.3097 34.3671 0.7097 4.2465 1.9541 36.4643 3.1976 35.8218 57.2647 5.2727 1.0516 32.2873 66.4773 0.7753 1.1329 9.3999 15.8172 11.8353 27.6845 12.6141 48.8240 4.5134 0.1445 9.3933 38.0389 45.3257 2.3351 124.5006 20.7277 33.3551 44.9849 6.2838 28.5403 146.8447 16.7887 250.4230 3.7450 14.3547 1.3309 61.4960 4.6911 2.2517 13.3600 7.8025 14.4081 10.5209 15.7131 2.6845 38.9894 32.4126 27.2251 16.2584 48.2156 12.3710 131.8041 15.1934 26.3293 85.6343 115.1044 270.1710 3.2203 7.3991 40.1027 13.4395 14.4520 67.4528 26.5004 86.5813 22.5875 4.1031 27.9943 18.0009 17.8641 30.1568 14.6724 32.3432 23.7672 14.2130 14.8390 8.4476 6.7340 0.8824 10.0130 1.0636
temp: 298.150 k
press: 1.00000 atm
elementType: 16 8 8 8 8 8 7 6 6 6 6 6 6 6 6 6 6 6 6 6 6 6 6 6 6 6 1 1 1 1 1 1 1 1 1 1 1 1 1 1 1 1 1 1 1 1 1
symmnumber: 1
zpe: 950584.8 jmol-1
zpe.correction: 0.362059 hartree
zpe.thermalcorrener: 0.388811 hartree
zpe.thermalcorrenthalpy: 0.389755 hartree
zpe.thermalcorrgfe: 0.301830 hartree
zpe.sumelectzpe: -1563.435385 hartree
zpe.sumelectthermal: -1563.408632 hartree
zpe.sumelectthermalent: -1563.407688 hartree
zpe.sumelectthermalfe: -1563.495613 hartree
dipole: 1.0243 6.5270 -4.0603
dipole: 7.7548
quadrupole: -141.3650 -148.0390 -162.4457
quadrupole: 0.0021 1.3982 13.3026
quadrupole: 9.2516 2.5776 -11.8292 0.0021 1.3982 13.3026
hfenergy: -1563.7974432 hartree
pointgroup: C01 [X(C19H21N1O5S1)]
dipole: 0.2814516 2.6762834 -1.437622 debye
polarizability: 353.860704|3.4942701|329.8749728|-20.2490998|19.1775662|180.8555727 unknown
InChI: InChI=1S/C12H14NO3.C7H7O2S/c1-15-11-6-8-9(7-12(11)16-2)13-5-3-4-10(8)14;1-6-2-4-7(5-3-6)10(8)9/h6-7H,3-5H2,1-2H3;2-5H,1H3
charge 0 multiplicity 1
47 atoms
S  1.23551 -2.042364 0.394128
O  1.902561 -3.481177 -0.018177
O  0.47152 -1.848767 1.829866
O  -4.126267 -1.613738 0.685506
O  -0.057492 3.13221 -0.683284
O  -2.710834 3.137556 0.492992
N  -0.021412 -1.55204 -1.224092
C  -0.500726 -2.870728 -1.69825
C  -1.523172 -3.642993 -0.844464
C  -0.876765 -0.493632 -0.820717
C  -2.935971 -3.031015 -0.849718
C  -2.218112 -0.534728 -0.287622
C  -3.119608 -1.726762 -0.082346
C  -0.24796 0.783428 -0.939071
C  2.581318 -0.734494 0.292053
C  -2.809325 0.693056 0.114773
C  -0.844397 1.988869 -0.538711
C  -2.160003 1.935928 0.032024
C  2.517414 0.356477 1.171681
C  3.617937 -0.919848 -0.638111
C  3.550878 1.318041 1.101075
C  4.637298 0.053874 -0.686695
C  4.615895 1.18661 0.173228
C  5.712266 2.232759 0.090248
C  -0.682701 4.429201 -1.023003
C  -4.027937 3.074959 1.144128
H  0.406715 -3.490269 -1.822416
H  -0.908571 -2.683942 -2.713932
H  -1.147009 -3.748721 0.190356
H  -1.589719 -4.667393 -1.258769
H  -3.667596 -3.740468 -0.425849
H  -3.240333 -2.842006 -1.902294
H  0.750352 0.827759 -1.381209
H  -3.81249 0.611285 0.544571
H  1.697447 0.439343 1.891994
H  3.637229 -1.805334 -1.280909
H  3.522539 2.182017 1.774099
H  5.462537 -0.068416 -1.398089
H  5.633266 2.814402 -0.847968
H  5.659167 2.945881 0.930075
H  6.714479 1.767102 0.10038
H  -1.268674 4.82157 -0.178457
H  -1.333044 4.325808 -1.911233
H  0.168228 5.087752 -1.254169
H  -3.999093 2.414422 2.030281
H  -4.804656 2.722463 0.439907
H  -4.24169 4.108865 1.451387
