program: Gaussian 09
title: 000027333
version: EM64L-G09RevD.01
frameworkgroup: C1[X(C16H34N2O4)]
method: RPBEPBE
basis: SDD
operation: Freq
keyword: #p
keyword: freq=noraman
keyword: PBEPBE/SDD
title: #p freq=noraman PBEPBE/SDD
converged: NO YES NO NO
title: Mulliken charges:
elementType: O O O O N N C C C C C C C C C C C C C C C C H H H H H H H H H H H H H H H H H H H H H H H H H H H H H H H H H H
charge: -0.318193 -0.318190 -0.222206 -0.222207 -0.097906 -0.097907 -0.071569 -0.071563 -0.375766 -0.375766 0.021747 0.021744 -0.395357 -0.395356 -0.351563 -0.351563 -0.549020 -0.579117 -0.564742 -0.564736 -0.579117 -0.549020 0.264498 0.264495 0.280773 0.274308 0.280771 0.274309 0.225046 0.225046 0.247994 0.228250 0.228249 0.247994 0.218758 0.274138 0.218758 0.274137 0.272937 0.273867 0.274144 0.273335 0.286764 0.272116 0.260595 0.260918 0.315253 0.315247 0.260919 0.260595 0.286764 0.272116 0.273335 0.274145 0.272937 0.273866
chargesum: 2.00000
title: Mulliken charges with hydrogens summed into heavy atoms:
elementType: O O O O N N C C C C C C C C C C C C C C C C
charge: -0.318193 -0.318190 -0.222206 -0.222207 -0.097906 -0.097907 0.192929 0.192932 0.179315 0.179313 0.246792 0.246790 0.080887 0.080886 0.141332 0.141331 0.271928 0.253098 0.272024 0.272025 0.253098 0.271928
polarizability: 2.32372869e+02 4.26506865e-01 1.81292146e+02 3.87966584e-05 -1.88743495e-05 1.66016665e+02
1716.lowfreq: -12.5689 -10.8782 -4.1926 -0.0002 0.0006 0.0012 7.1618 12.9374 18.8146
frequency: -3.6339 12.8805 18.5295 24.9840 33.9450 61.5315 67.6103 90.2635 103.2473 123.3575 127.6637 167.3391 179.2805 205.5915 212.8777 217.5393 220.8489 258.2414 262.0834 271.4159 275.8312 282.1429 284.5685 293.4535 295.3701 317.3916 341.8352 344.3854 373.0307 396.0717 408.7466 430.1502 430.3379 468.0898 469.6215 491.9103 496.0187 501.4398 512.1442 641.0112 641.5100 648.8829 668.0517 714.1466 726.2393 727.9681 740.7221 820.3928 825.3364 847.6272 875.9017 876.9076 889.4260 892.6332 902.3462 925.1020 932.8692 940.6834 943.1089 950.8566 989.4569 1006.1260 1015.6676 1029.6126 1052.1431 1053.1864 1053.4145 1056.0566 1064.7631 1068.7001 1080.0766 1080.1534 1111.8597 1111.9531 1113.6423 1129.1496 1131.3744 1146.1771 1184.0212 1184.1905 1201.6060 1204.0674 1206.3334 1225.9916 1226.2257 1253.4275 1253.4434 1254.1036 1273.5351 1274.3323 1279.9278 1289.0058 1300.3985 1300.7694 1301.6798 1330.6654 1331.2451 1340.3569 1354.8225 1359.4217 1378.5774 1379.4733 1384.0402 1394.8045 1425.2167 1425.2215 1426.8660 1426.9198 1438.3299 1438.3354 1450.4182 1452.7597 1452.7680 1461.3622 1461.5144 1462.6144 1467.1269 1467.1405 1471.2032 1471.2451 1474.4840 1474.5468 1482.0344 1482.1069 1489.4059 1489.4244 1501.9149 1502.0475 2950.0940 2950.1928 2974.0518 2974.2187 3001.4995 3006.6191 3015.5012 3015.5106 3022.4262 3022.4487 3023.9644 3023.9770 3026.7812 3026.7899 3033.2331 3033.3171 3070.7763 3092.0795 3093.8578 3093.8689 3123.3058 3123.3206 3138.6817 3138.6903 3141.7932 3141.7943 3144.0464 3144.0489 3147.1630 3147.1752 3150.8289 3150.8401 3154.5831 3154.6226
redmass: 4.0533 3.0797 2.9163 4.2521 3.7958 4.3329 4.8698 4.8120 3.0824 2.9606 2.8181 2.7755 3.7530 2.0078 1.2621 1.1832 1.6517 4.2895 1.8640 1.2135 1.6816 1.2416 1.1207 2.2686 1.8006 3.8790 2.3476 2.3584 2.8669 2.5331 3.0767 2.1910 2.1899 2.3063 2.2483 2.4755 2.6661 2.5178 3.1330 3.7301 4.4691 5.0377 5.8005 3.1035 4.4325 4.0111 4.2778 3.0967 3.9724 1.8740 3.5997 3.3347 2.4344 2.3441 3.5933 3.2198 2.4297 3.1400 2.4204 2.4332 5.6581 4.1254 2.6167 3.0627 2.4071 1.2886 1.2428 3.0577 2.0239 2.2564 2.2091 2.1115 1.3684 1.3865 1.7612 1.7218 1.7280 2.5105 1.2252 1.2029 1.4312 1.3972 1.3763 1.7022 1.7028 1.7609 1.8619 1.1927 1.2520 1.1801 1.1941 1.2417 1.3294 1.3680 1.2198 1.1815 1.1789 1.2652 1.2515 1.2617 1.3341 1.3196 1.5008 1.7761 1.1419 1.1415 1.1502 1.1500 1.0887 1.0886 1.0752 1.0469 1.0467 1.1150 1.1151 1.0935 1.0579 1.0587 1.0567 1.0556 1.0872 1.0876 1.0540 1.0542 1.0518 1.0516 1.0518 1.0517 1.0855 1.0857 1.0693 1.0693 1.0634 1.0629 1.0592 1.0591 1.0316 1.0316 1.0341 1.0340 1.0387 1.0387 1.0787 1.0788 1.0969 1.1007 1.1059 1.1059 1.0980 1.0980 1.1054 1.1054 1.1057 1.1057 1.1056 1.1056 1.1053 1.1052 1.1063 1.1063 1.1065 1.1065
irintensity: 4.8819 0.9285 1.1722 7.0381 0.0665 4.6213 0.3777 0.0277 0.8758 8.2965 2.6057 0.9318 3.8911 5.2210 0.5522 0.5491 0.5429 9.9208 0.9216 0.0095 1.6724 3.6374 0.0211 2.9559 6.4471 0.9012 0.0365 0.0131 8.9269 0.0017 10.3950 0.0595 0.1488 6.8828 0.5887 1.9417 13.2720 0.0086 19.8474 0.5699 5.4263 0.1142 8.6008 24.6041 2.3524 4.8648 74.8011 0.0412 81.3727 75.7306 172.2094 14.4277 21.3971 14.3821 38.5002 1.1251 37.3170 8.1990 5.3032 10.7783 72.0375 5.1126 2.7193 6.9976 139.9489 0.0195 7.1684 3.6839 2.9516 0.0434 1.0051 21.1633 2.0051 4.9609 23.4014 6.7228 1.8632 64.3457 0.4313 1.9909 1.4495 10.2329 2.7015 0.2137 0.0939 1.5292 0.2160 6.6120 8.0635 1.7371 4.4687 0.3896 2.1410 0.4646 3.0670 15.6828 0.0026 5.0078 9.1516 1.2827 42.2852 2.6980 64.2753 0.4004 12.6285 14.8823 0.0155 32.5154 4.0346 11.9433 0.3166 0.1536 0.5256 10.6264 10.5783 30.9550 15.4187 0.8393 20.0326 1.1226 10.0515 12.3039 27.7998 54.2496 3.0790 86.8326 78.7784 59.2506 22.1165 66.6294 57.1054 29.4260 2.8073 16.3897 8.2385 1.0137 16.5442 0.1622 7.9908 0.0367 5.9749 0.5847 8.3164 34.2263 2.0537 22.8699 2.9864 6.2057 4.9477 4.6761 0.3915 2.1750 3.8060 1.2357 2.9573 3.6223 6.1950 9.0632 7.1214 0.6912 4.4016 0.8881
temp: 298.150 k
press: 1.00000 atm
elementType: 8 8 8 8 7 7 6 6 6 6 6 6 6 6 6 6 6 6 6 6 6 6 1 1 1 1 1 1 1 1 1 1 1 1 1 1 1 1 1 1 1 1 1 1 1 1 1 1 1 1 1 1 1 1 1 1
symmnumber: 1
zpe: 1312964.8 jmol-1
zpe.correction: 0.500082 hartree
zpe.thermalcorrener: 0.524587 hartree
zpe.thermalcorrenthalpy: 0.525532 hartree
zpe.thermalcorrgfe: 0.444153 hartree
zpe.sumelectzpe: -1038.078802 hartree
zpe.sumelectthermal: -1038.054296 hartree
zpe.sumelectthermalent: -1038.053352 hartree
zpe.sumelectthermalfe: -1038.134730 hartree
dipole: -0.0002 -0.0001 5.3534
dipole: 5.3534
quadrupole: 171.6955 -113.2812 -107.3236
quadrupole: -17.7011 -0.0003 -0.0001
quadrupole: 187.9986 -96.9781 -91.0205 -17.7011 -0.0003 -0.0001
hfenergy: -1038.5788834 hartree
pointgroup: C01 [X(C16H34N2O4)]
dipole: 0.0000231 2.1061975 -0.000134 debye
polarizability: 231.5783896|0.0016974|166.0166654|6.3350835|0.0008619|182.0866255 unknown
InChI: InChI=1S/C16H34N2O4/c1-17(2,3)9-13-11-19-15(21-13)7-8-16-20-12-14(22-16)10-18(4,5)6/h13-16H,7-12H2,1-6H3
charge 2 multiplicity 1
56 atoms
O  -2.569543 0.118261 -0.047789
O  2.569505 0.11835 0.047843
O  -2.348705 -0.957812 2.022249
O  2.348689 -0.957942 -2.022085
N  -5.237964 1.107311 -1.373801
N  5.237932 1.107675 1.373703
C  -3.829735 0.345869 0.704968
C  3.82968 0.345933 -0.704952
C  -5.070511 0.137718 -0.174286
C  5.07048 0.137935 0.174306
C  -1.81775 -0.979118 0.672673
C  1.817741 -0.979126 -0.672504
C  -0.318716 -0.721571 0.703844
C  0.318699 -0.721627 -0.703696
C  -3.786684 -0.702748 1.864646
C  3.786659 -0.702809 -1.864517
C  -6.671411 0.962077 -1.895276
C  -5.008872 2.55819 -0.952942
C  -4.259784 0.744041 -2.498098
C  4.259829 0.744488 2.498095
C  5.00875 2.558496 0.952691
C  6.671411 0.962575 1.895128
H  -3.792464 1.368346 1.120905
H  3.792358 1.368361 -1.121003
H  -5.975573 0.263098 0.448678
H  -5.07242 -0.879708 -0.602283
H  5.975522 0.26328 -0.448694
H  5.072443 -0.879442 0.602419
H  -2.078656 -1.932115 0.160809
H  2.078679 -1.932062 -0.160543
H  -0.132634 0.231977 1.226651
H  0.11649 -1.530174 1.323752
H  -0.116482 -1.530303 -1.323528
H  0.132586 0.231865 -1.226593
H  -4.32286 -1.636623 1.595456
H  -4.157525 -0.318644 2.82531
H  4.322871 -1.636637 -1.595233
H  4.15748 -0.318793 -2.825225
H  -7.37496 1.338396 -1.136784
H  -6.77546 1.546093 -2.822262
H  -6.874265 -0.099927 -2.101518
H  -5.626438 2.784998 -0.070091
H  -3.944089 2.708144 -0.724974
H  -5.302805 3.213593 -1.78702
H  -4.537045 -0.242373 -2.900935
H  -4.33982 1.505576 -3.288995
H  -3.24538 0.70427 -2.07737
H  3.2454 0.70465 2.077435
H  4.339895 1.506102 3.288913
H  4.537142 -0.24188 2.901009
H  3.943944 2.708382 0.724786
H  5.302718 3.214007 1.786672
H  5.62624 2.785226 0.069768
H  6.874324 -0.099394 2.101492
H  7.374906 1.338834 1.136557
H  6.775475 1.54671 2.822038
