program: Gaussian 09
title: 000294685
version: EM64L-G09RevD.01
frameworkgroup: C1[X(C11H11N3O5)]
method: RPBEPBE
basis: SDD
operation: Freq
keyword: #p
keyword: freq=noraman
keyword: PBEPBE/SDD
title: #p freq=noraman PBEPBE/SDD
converged: NO YES NO NO
title: Mulliken charges:
elementType: O O O O O N N N C C C C C C C C C C C H H H H H H H H H H H
charge: -0.258890 -0.252630 -0.249463 -0.238271 -0.210332 -0.217294 -0.222408 -0.431554 0.327882 -0.033003 0.179960 0.408877 0.226287 -0.434494 -0.664648 0.094056 -0.597675 0.120638 -0.500098 0.365379 0.273352 0.247997 0.303075 0.247385 0.253089 0.254168 0.274921 0.243769 0.231391 0.258537
chargesum: 0.00000
title: Mulliken charges with hydrogens summed into heavy atoms:
elementType: O O O O O N N N C C C C C C C C C C C
charge: -0.258890 -0.252630 -0.249463 -0.238271 -0.210332 -0.217294 -0.222408 -0.066176 0.327882 -0.033003 0.179960 0.408877 0.226287 -0.161143 0.133808 0.094056 0.184502 0.120638 0.233599
polarizability: 1.99610031e+02 -5.92817389e+00 2.09114331e+02 5.99279553e+00 5.87965715e-01 8.80557288e+01
1716.lowfreq: -8.7310 -4.3048 0.0003 0.0005 0.0008 3.7166 24.6163 56.1151 72.2956
frequency: 24.5755 56.1109 72.2932 83.0057 99.8259 101.9585 112.9805 131.9151 139.0737 194.6009 211.2219 231.8507 241.3657 248.3489 281.4767 290.3711 314.6334 316.3398 354.8439 361.4605 396.2459 400.4492 435.3638 477.8028 502.9898 583.9342 623.7768 636.5972 661.5084 669.6945 695.7166 711.1734 724.6856 739.6599 755.6992 774.5671 834.7343 861.5851 873.7192 943.1625 953.8799 1001.5144 1047.9847 1084.7855 1111.3967 1125.2610 1131.4031 1151.3528 1190.9528 1199.9319 1215.0088 1237.3434 1246.6536 1257.7124 1315.2492 1339.0359 1411.7246 1420.3100 1425.1476 1444.3928 1451.6953 1464.3193 1472.8724 1476.0901 1477.0899 1498.1643 1504.2247 1561.1535 1568.8681 1614.6876 1634.1743 1637.6528 1664.8214 2986.5959 3007.8185 3016.9691 3074.4622 3110.5935 3114.3219 3127.3677 3146.4156 3153.1098 3192.5535 3516.7872
redmass: 7.4168 3.8146 3.3397 3.7203 1.4622 1.3086 2.3164 7.5557 3.3965 5.1971 2.7695 2.6425 6.6409 2.0169 5.7189 5.1100 4.2440 3.3953 7.0686 6.2445 6.0783 6.2771 8.2264 6.6285 9.0895 6.9941 3.9192 3.5357 5.9962 3.9162 7.2883 9.7665 5.8341 2.2555 5.7838 7.9680 5.1651 2.7252 2.3862 4.2564 6.7702 2.7945 2.6513 3.4773 1.2943 1.2972 1.3097 1.4495 4.1267 7.0484 4.6036 4.2303 1.6107 3.3539 2.4186 3.2252 1.5852 1.2769 1.3512 1.9637 1.0504 1.0517 1.3901 1.0509 1.0955 2.6674 1.0426 7.0986 8.3564 7.7606 8.5497 10.6820 7.3784 1.0358 1.0289 1.0330 1.1039 1.1026 1.1051 1.0971 1.1023 1.1051 1.0933 1.0766
irintensity: 1.4284 2.0130 1.3395 0.6465 2.9121 0.2036 2.5353 10.0457 1.9256 1.9002 0.7981 2.9971 10.4918 1.9247 1.7570 8.4378 0.3747 0.4538 4.3351 25.0554 19.9665 16.5540 18.8565 24.6768 6.8036 1.7351 8.6565 16.9659 4.4542 19.4598 8.3443 15.0133 24.6677 36.9124 12.6962 18.6372 18.1143 36.3969 17.2893 26.1451 3.0867 69.8085 18.4685 153.8806 2.9439 0.0442 0.0759 21.7045 75.0180 48.0571 42.6763 13.1866 55.4499 20.6308 20.3188 102.6694 64.1582 56.6185 19.6251 208.6593 14.6650 8.6668 18.2352 16.8871 7.5577 144.7672 21.7040 223.7912 135.6912 645.5515 452.4181 161.4391 487.2757 30.1695 33.6366 24.0048 16.2167 13.7855 17.0567 2.0297 0.8685 14.4294 1.1704 49.6340
temp: 298.150 k
press: 1.00000 atm
elementType: 8 8 8 8 8 7 7 7 6 6 6 6 6 6 6 6 6 6 6 1 1 1 1 1 1 1 1 1 1 1
symmnumber: 1
zpe: 573939.4 jmol-1
zpe.correction: 0.218602 hartree
zpe.thermalcorrener: 0.236545 hartree
zpe.thermalcorrenthalpy: 0.237489 hartree
zpe.thermalcorrgfe: 0.172104 hartree
zpe.sumelectzpe: -964.813461 hartree
zpe.sumelectthermal: -964.795518 hartree
zpe.sumelectthermalent: -964.794574 hartree
zpe.sumelectthermalfe: -964.859959 hartree
dipole: 3.3396 -1.1025 2.0468
dipole: 4.0691
quadrupole: -104.5299 -119.9953 -112.6594
quadrupole: 14.8197 -8.3726 -1.9669
quadrupole: 7.8650 -7.6004 -0.2645 14.8197 -8.3726 -1.9669
hfenergy: -965.0320631 hartree
pointgroup: C01 [X(C11H11N3O5)]
dipole: 1.3715961 -0.1591065 0.8101566 debye
polarizability: 201.9268925|-6.876155|206.6677364|5.7767739|-4.7738992|88.1854618 unknown
InChI: InChI=1S/C11H11N3O5/c1-13-8-7(9(16)14(2)11(13)18)5(10(17)19-3)4-6(15)12-8/h4,12H,1-3H3
charge 0 multiplicity 1
30 atoms
O  -0.445631 -2.326528 -0.214414
O  3.94165 -0.755738 0.227909
O  -2.778099 -1.179012 1.082079
O  -1.176439 4.082913 -0.125357
O  -3.218962 -0.952809 -1.202338
N  2.209018 0.821709 0.109265
N  1.748086 -1.534821 0.02977
N  0.433906 2.40297 -0.000103
C  0.847613 1.091833 0.019395
C  -0.108586 0.059271 -0.050106
C  0.330117 -1.335188 -0.084895
C  -1.502968 0.425405 -0.123973
C  2.706929 -0.519954 0.131203
C  -1.901134 1.751628 -0.163399
C  3.204789 1.911423 0.194768
C  -0.940723 2.840203 -0.104232
C  2.268348 -2.92351 0.024767
C  -2.565628 -0.649548 -0.181873
C  -3.686891 -2.351149 1.133913
H  1.108104 3.17319 0.049532
H  -2.953901 2.032824 -0.230778
H  3.179016 2.543913 -0.711194
H  4.194243 1.437065 0.265763
H  3.040963 2.527108 1.097751
H  2.808815 -3.125828 0.963488
H  2.965272 -3.0619 -0.817448
H  1.40348 -3.593894 -0.077186
H  -4.661798 -2.105077 0.681371
H  -3.788191 -2.580565 2.203448
H  -3.219496 -3.186437 0.586673
